"File Downloaded","Full Name",Company,"Street Address",City,State,Zip,Phone,Fax,Email,About,Business,"Date Downloaded","Time Downloaded"
"Golf Learning Center Addition & Renovation","Mary Harden","Peoria Park District","1314 N Park Road ",Peoria,IL,61604,"(309) 686-3386",,mharden@peoriaparks.org,"Other; ","None of the Above; ",2024-04-10,12:40:28
"Golf Learning Center Addition & Renovation","Bill Aupperle","Aupperle Construction","200 Penn Ave ",Morton,IL,61550,"(309) 266-7460",,bill@aupperle.org,"General Contractor; Sub Contractor; ","Veteran-owned business; ",2024-04-10,12:45:37
"Golf Learning Center Addition & Renovation","Daniel Muno","George H. Rump Construction Co."," ",,,,"(309) 637-6114",,Dan@rumpconstruction.com,"General Contractor; ","None of the Above; ",2024-04-10,12:56:15
"Golf Learning Center Addition & Renovation","Cornelius Williams","Vision Remodeling","1416 Sandhurst Lane ",Rockford,IL,61107,"(815) 262-9999",,Visioncontractor.inc@gmail.com,"General Contractor; ","Minority-owned business; ",2024-04-10,13:04:00
"Golf Learning Center Addition & Renovation","Grant Zobrist","N. Zobrist & Sons, Inc.","95 Commerce Drive ",MORTON,IL,61550,"(309) 263-1230",,grant@zobristconstruction.com,"General Contractor; ","None of the Above; ",2024-04-10,13:04:27
"Golf Learning Center Addition & Renovation","David Staggs","Hein Construction","9130 North Industrial Road ",Peoria,Illinois,61615,"(309) 691-4774",,jstaggs@heinconstruction.com,"General Contractor; ","None of the Above; ",2024-04-10,13:04:31
"Golf Learning Center Addition & Renovation","Sally Lowe","Illinois Civil Contractors, Inc.","420 Pinecrest Dr ","East Peoria",IL,61611-4817,"(309) 694-4224",,slowe@ilcivil.com,"General Contractor; Sub Contractor; ","None of the Above; ",2024-04-10,13:09:53
"Golf Learning Center Addition & Renovation","Jack Immesoete","Hein Construction","9130 N Industrial Road ",Peoria,Illinois,61615,"(309) 696-7314",,jimmesoete@heinconstruction.com,"General Contractor; ","None of the Above; ",2024-04-10,13:12:26
"Golf Learning Center Addition & Renovation","Kelly M Anderson","D Joseph Construction Co","5001 N University St ",Peoria,IL,61614,"(309) 692-1135",,kellyanderson@djoseph.com,"General Contractor; ","None of the Above; ",2024-04-10,13:16:21
"Golf Learning Center Addition & Renovation","TOM JONES","VISSERING CONSTRUCTION COMPANY","175 BENCHMARK INDUSTRIAL DRIVE ",STREATOR,IL,61364,"(815) 673-5511",,TJONES@VISSERING.COM,"General Contractor; ","None of the Above; ",2024-04-10,13:19:40
"Golf Learning Center Addition & Renovation","Patrick Thompson","VEYA Inc.","601 S. Country Fair Dr. ",Champaign,IL,61821,"(217) 607-1500",,patrick@veyainc.com,"Sub Contractor; ","Minority-owned business; ",2024-04-10,13:23:10
"Golf Learning Center Addition & Renovation","Colleen Salerno","Greater Peoria Contractors Suppliers Association"," ",,Illinois,,"(309) 692-5710",,csalerno@gpcsa.org,"Plan Room; ","None of the Above; ",2024-04-10,13:23:41
"Golf Learning Center Addition & Renovation","Justin Bishop","Bishop Bros Inc","PO Box 3854 ",Peoria,Illinois,61612,"(309) 243-5599",,bishopbrothers@bishopbrosconstruction.com,"General Contractor; ","None of the Above; ",2024-04-10,13:51:00
"Golf Learning Center Addition & Renovation","Nathan Zeltwanger","CAD Construction, Inc.","150 S Baer Road ",Tremont,IL,61568,"(309) 925-2092","(309) 925-2091",nate@cadconstructioninc.com,"General Contractor; ","Woman-owned business; ",2024-04-10,13:55:12
"Golf Learning Center Addition & Renovation","Dexter Davis","Buddy's Grounds Maint., Inc.","PO Bx 1125 ",Bloomington,IL,61702,"(309) 824-9211",,dexterdavis2@aol.com,"Sub Contractor; ","Minority-owned business; ",2024-04-10,14:06:18
"Golf Learning Center Addition & Renovation","Riley Baum","Otto Baum Company, Inc.","866 N. Main Street ",Morton,Illinois,61550,"(309) 266-7114",,estimating@ottobaum.com,"Sub Contractor; ","None of the Above; ",2024-04-10,14:17:10
"Golf Learning Center Addition & Renovation","Patricia A Slusher","C&G Concrete Construction Co., Inc.","1906 MEADOW AVE ","East Peoria (Tazewell)",IL,61611,"(309) 699-0384",,tricia@cngconcrete.com,"General Contractor; ","Woman-owned business; ",2024-04-10,14:20:50
"Golf Learning Center Addition & Renovation","Ashe Himegarner","Cook Fasser","5835 n Galena rd ","peoria heights",il,61614,"(309) 349-0746",,ahimegarner@cookfasser.com,"Supplier; ","Woman-owned business; ",2024-04-10,14:22:50
"Golf Learning Center Addition & Renovation","Patricia A Slusher","C&G Concrete Construction Co., Inc.","1906 MEADOW AVE ","East Peoria (Tazewell)",IL,61611,"(309) 699-0384",,tricia@cngconcrete.com,"General Contractor; ","Woman-owned business; ",2024-04-10,14:25:20
"Golf Learning Center Addition & Renovation","Matthew Whaley","Agile Supply Company","706 W Bradley Ave ",Urbana,IL,61801,"(217) 729-2686",,matthew.whaley@agilesupplycompany.com,"Sub Contractor; ","Minority-owned business; ",2024-04-10,14:28:25
"Golf Learning Center Addition & Renovation","Emily Jacob-Rudesill","Foster-Jacob, Inc.","826 W Main St ",Peoria,IL,61606,"(309) 674-8129",,emilyj@fosterjacob.com,"Sub Contractor; ","Woman-owned business; ",2024-04-10,14:41:07
"Golf Learning Center Addition & Renovation","Patrick Thompson","VEYA Inc.","601 S. Country Fair Dr. ",Champaign,IL,61821,"(217) 607-1500",,patrick@veyainc.com,"Sub Contractor; ","Minority-owned business; ",2024-04-10,14:51:01
"Golf Learning Center Addition & Renovation","Monica Arbuckle","AFE Construction, LLC","2216 W. Altorfer Dr. ",Peoria,IL,61615,"(309) 208-3094","(866) 491-2209",monica@afeconstruction.net,"General Contractor; ","Minority-owned business; Woman-owned business; ",2024-04-10,14:55:55
"Golf Learning Center Addition & Renovation",Mary,"Peoria Park Dist","1314 N Park Road ",Peoria,Il,61604,"(309) 686-3386",,mharden@peoriaparks.org,"Other; ","None of the Above; ",2024-04-10,15:26:35
"Golf Learning Center Addition & Renovation","Krystle Miller","Central Illinois Plan Room","1620 S 5th Street ",Springfield,IL,62703,"(217) 679-1077",,plans@ciplanroom.com,"Plan Room; ","None of the Above; ",2024-04-10,16:17:38
"Golf Learning Center Addition & Renovation","Edward C Counsil III","Hanley Steel, Inc.","8811 N Industrial Road ",Peoria,Illinois,61615,"(309) 692-5250","(309) 692-5251",counsil@hanleysteel.com,"Supplier; ","None of the Above; ",2024-04-10,16:21:08
"Golf Learning Center Addition & Renovation","Jen Stephens","BPI Testing, LLC","2911 Gill St #1A ",Bloomington,IL,61705,"(309) 663-1500",,jen@bpitestingllc.com,"Sub Contractor; ","Woman-owned business; ",2024-04-10,17:55:54
"Golf Learning Center Addition & Renovation","Riley Baum","Otto Baum Company, Inc.","866 N. Main Street ",Morton,Illinois,61550,,,estimating@ottobaum.com,"Sub Contractor; ","None of the Above; ",2024-04-10,18:50:10
"Golf Learning Center Addition & Renovation","Ryan Zobrist","Zobrist Construction","95 Commerce Drive ",Morton,IL,61550,"(309) 263-1230","(309) 263-2838",ryan@zobristconstruction.com,"General Contractor; ","None of the Above; ",2024-04-10,19:01:05
"Golf Learning Center Addition & Renovation","Chris Rossman","Millennia Professional Services","850 N Main St ",Morton,IL,61550,"(309) 324-2000",,crossman@millennia.pro,"Other; ","Minority-owned business; ",2024-04-10,19:06:52
"Golf Learning Center Addition & Renovation","Nathan Zeltwanger","CAD Construction, Inc.","150 S Baer Road ",Tremont,IL,61568,"(309) 925-2092","(309) 925-2091",nate@cadconstructioninc.com,"General Contractor; ","Woman-owned business; ",2024-04-10,19:10:49
"Golf Learning Center Addition & Renovation","Matthew Whaley","Agile Supply Company","706 W Bradley Ave ",Urbana,IL,61801,"(217) 729-2686",,matthew.whaley@agilesupplycompany.com,"Sub Contractor; ","Minority-owned business; ",2024-04-10,19:13:20
"Golf Learning Center Addition & Renovation","Greg Bachler","PJ Hoerr, Inc.","107 W Commerce Dr ",Peoria,IL,61604,"(309) 688-9567",,greg@pjhoerr.com,"General Contractor; ","None of the Above; ",2024-04-10,19:27:38
"Golf Learning Center Addition & Renovation","Sally Lowe","Illinois Civil Contractors, Inc.","420 Pinecrest Dr ","East Peoria",IL,61611-4817,"(309) 694-4224",,slowe@ilcivil.com,"General Contractor; Sub Contractor; ","None of the Above; ",2024-04-10,19:35:17
"Golf Learning Center Addition & Renovation","John Sutherland","Built United, LLC","921 S. Bosch Rd ",Peoria,Illinois,61607,"(309) 699-9191",,john@builtunited.com,"Sub Contractor; ","Minority-owned business; ",2024-04-10,19:35:29
"Golf Learning Center Addition & Renovation","John Gleason","JOHNSON HVACR & FOODSERVICE EQUIPMENT","1820 Riverway Drive ",Pekin,IL,61554,"(309) 208-7608",,jgleason@jmsinc.net,"Supplier; ","Woman-owned business; ",2024-04-10,19:42:56
"Golf Learning Center Addition & Renovation","Greg Bachler","PJ Hoerr, Inc.","107 N. Commerce Place ",Peoria,IL,61604,"(309) 688-9567",,greg@pjhoerr.com,"General Contractor; ","None of the Above; ",2024-04-10,19:55:56
"Golf Learning Center Addition & Renovation","Kelly M Anderson","D Joseph Construction Co","5001 N University St ",Peoria,IL,61614,"(309) 692-1135",,kellyanderson@djoseph.com,"General Contractor; ","None of the Above; ",2024-04-10,20:17:30
"Golf Learning Center Addition & Renovation","Carla Millar","Millar Construction, Inc.","122 E Sangamon Ave. ",Rantoul,IL,61866,"(217) 282-9468",,carla@millar-inc.com,"Sub Contractor; ","Woman-owned business; ",2024-04-10,23:25:10
"Golf Learning Center Addition & Renovation","Colleen Salerno","Greater Peoria Contractors Suppliers Association"," ",,Illinois,,"(309) 692-5710",,csalerno@gpcsa.org,"Plan Room; ","None of the Above; ",2024-04-11,12:45:09
"Golf Learning Center Addition & Renovation","Kurt Eccles","H&S Mechanical Inc."," ",,,,"(309) 231-8454",,kurt@hsmechanicalinc.com,"Sub Contractor; ","Woman-owned business; ",2024-04-11,13:16:29
"Golf Learning Center Addition & Renovation","Ashe Himegarner","cook fasser","5835 n galena rd ","peoria heights",il,61614,"(309) 349-0746",,ahimegarner@cookfasser.com,"Supplier; ","Woman-owned business; ",2024-04-11,14:44:13
"Golf Learning Center Addition & Renovation","Todd Thompson","Thompson Brothers Inc.","PO Box 313 ",Pekin,IL,61555,"(309) 613-0254",,bid@tbrosinc.com,"Sub Contractor; ","Minority-owned business; ",2024-04-11,14:51:24
"Golf Learning Center Addition & Renovation","Jessica Cohen","TSI Commercial Floor Covering","3611 N Staley Rd ",Champaign,IL,61884,"(217) 328-7321",,info@tsicfcacr.com,"Sub Contractor; ","Woman-owned business; ",2024-04-11,15:00:38
"Golf Learning Center Addition & Renovation","Pat Francois","Data Bid, Inc.","411 S State St ",Newtown,PA,19180,"(812) 512-9681",,pgrant@databid.com,"Other; ","None of the Above; ",2024-04-11,15:57:46
"Golf Learning Center Addition & Renovation","Jack Immesoete","Hein Construction","9130 N Industrial Road ",Peoria,Illinois,61615,"(309) 696-7314",,jimmesoete@heinconstruction.com,"General Contractor; ","None of the Above; ",2024-04-11,16:01:32
"Golf Learning Center Addition & Renovation","Jessica Cohen","TSI Commercial Floor Covering","3611 N Staley Rd ",Champaign,IL,61822,"(217) 328-7321",,info@tsicfcacr.com,"Sub Contractor; ","Woman-owned business; ",2024-04-11,16:48:46
"Golf Learning Center Addition & Renovation","Corey Campbell","Landmark Roofing","504 Patricia St ",Washington,IL,61571,"(309) 634-8347",,corey@landmarkroofs.com,"General Contractor; ","None of the Above; ",2024-04-11,17:34:20
"Golf Learning Center Addition & Renovation","Javier Murillo","Murillo Concrete LLC","9810 N Garden Lane ",Peoria,IL,61615,"(309) 397-1316",,MurilloConcrete@gmail.com,"General Contractor; ","Minority-owned business; ",2024-04-11,19:07:14
"Golf Learning Center Addition & Renovation","sam shak","Tiles in Style","16940 Vincennes Ave ","South Holland",Illinois,60473,"(630) 473-9004",,sam@tilesinstyle.com,"Other; ","Minority-owned business; Woman-owned business; ",2024-04-11,20:10:15
"Golf Learning Center Addition & Renovation","Josh Couch",Eplan,"1400 Forum Blvd. Suite 7B",Columbia,MO,65202,"(877) 375-2666",,eplan@eplanbidding.com,"Plan Room; ","Woman-owned business; ",2024-04-11,20:12:00
"Golf Learning Center Addition & Renovation","Adam Riekena","Hoerr's Blacktop & Sealcoating","3715 N. Trivoli Rd. ",Trivoli,Select...,61569,"(309) 222-2979",,estimating.hoerrs@gmail.com,"Sub Contractor; ","None of the Above; ",2024-04-11,20:52:10
"Golf Learning Center Addition & Renovation","Justin Ellis","GIVSCO Construction Company","2323 Lakeshore Dr., Suite B ",Pekin,IL,61554,"(309) 620-9127",,jellis@givsco.com,"General Contractor; ","Minority-owned business; ",2024-04-11,20:55:21
"Golf Learning Center Addition & Renovation","Adam Bouman","Dodge Data & Analytics","300 American Metro Blvd #185 ","Hamilton Township",NJ,08619,"(051) 366-6335",,dodge.bidding@construction.com,"Other; ","None of the Above; ",2024-04-12,06:16:51
"Golf Learning Center Addition & Renovation","Dan Moore","River City Roofing Co.","6000 W Plank Rd ",Peoria,IL,61604,,,daniel@rivercityroofs.com,"Sub Contractor; ","None of the Above; ",2024-04-12,12:28:45
"Golf Learning Center Addition & Renovation","Spencer Mantalaba","Dodge Construction Network","2860 S State Hwy 161, Ste. 160 #501 ","Grand Prairie",TEXAS,75052,"(844) 326-3826",,dodge.docs@construction.com,"Plan Room; ","None of the Above; ",2024-04-12,12:50:12
"Golf Learning Center Addition & Renovation","Kurt Eccles","H&S Mechanical Inc."," ",,,,"(309) 231-8454",,kurt@hsmechanicalinc.om,"Sub Contractor; ","Woman-owned business; ",2024-04-12,13:59:17
"Golf Learning Center Addition & Renovation","S.F. Pauli Builders","S.F. Pauli Builders","3410 N. Main street ","East Peoria",IL,61611,"(309) 688-0790",,office@paulibuilders.com,"General Contractor; ","None of the Above; ",2024-04-12,16:28:58
"Golf Learning Center Addition & Renovation","Steve Ortman","Tri County Irrigation","405 State Route 117 ",Goodfield,Illinois,61742,"(309) 265-5284","(309) 965-2376",steve@tcicompaniesinc.com,"Sub Contractor; ","None of the Above; ",2024-04-15,13:07:57
"Golf Learning Center Addition & Renovation","George Sarraf","Peoria Metro Construction, Inc.","1925 South Darst Street ",Peoria,IL,61607,"(309) 671-1466",,gsarraf@peoriametro.com,"General Contractor; ","None of the Above; ",2024-04-15,13:13:30
"Golf Learning Center Addition & Renovation","James Cassidy","Commercial Irrigation & Turf, Inc.","109 Commercial ","East Peoria",IL,61611,"(309) 208-2146",,jim@comirr.com,"General Contractor; ","None of the Above; ",2024-04-15,14:21:49
"Golf Learning Center Addition & Renovation","Bill Knapp","Williams Brothers Construction Inc","PO Box 1366 ",Peoria,IL,61654,"(309) 688-0416","(309) 688-0891",estimating@wbci.us,"General Contractor; ","None of the Above; ",2024-04-15,15:19:54
"Golf Learning Center Addition & Renovation","Justin Sprout","H&S Mechanical Inc.","5607 S Washington Street ",Bartonville,IL,61607,"(309) 696-7066",,justin@hsmechanicalinc.com,"Sub Contractor; ","Woman-owned business; ",2024-04-15,15:45:23
"Golf Learning Center Addition & Renovation","Dustin C WIlgus","Givsco Construction","2323 Lakeshore DR ",Pekin,IL,61554,"(309) 620-3291",,dwilgus@givsco.com,"General Contractor; ","Minority-owned business; ",2024-04-15,16:37:21
"Golf Learning Center Addition & Renovation","Eric Matthews","Division 7 Sales, Inc","4605 W 139th St ",Leawood,KS,66224,"(816) 591-4663",,eric@division7sales.com,"Other; ","None of the Above; ",2024-04-15,16:42:25
"Golf Learning Center Addition & Renovation","Robert Howard","progressive constructipon","201 belview ",normal,ill,61761,"(309) 825-2853",,progressiveconstllc@gmail.com,"Sub Contractor; ","Minority-owned business; ",2024-04-15,17:04:09
"Golf Learning Center Addition & Renovation","Morgan Stinson",ConstructConnect,"3825 Edwards Rd. Ste. 800 ",Cincinnati,OH,45209,"(800) 364-2059",,content@constructconnect.com,"General Contractor; ","Minority-owned business; ",2024-04-15,17:18:47
"Golf Learning Center Addition & Renovation","Phil Molleck","Molleck Electric contractors","14926 w Winchester dr ",Brimfield,IL,61517,"(309) 253-6363",,Molleck21@yahoo.com,"Sub Contractor; ","Woman-owned business; ",2024-04-15,18:57:18
"Golf Learning Center Addition & Renovation","lorebi Siga",ConstructConnect,"3825 Edwards Rd. Suite 800 ",Cincinnati,OH,45209,"(323) 602-5079",,lore.siga@constructconnect.com,"Other; ","None of the Above; ",2024-04-15,20:24:32
"Golf Learning Center Addition & Renovation","Phil Heinz","Illinois Piping Corporation","2323 SW Washington Street ",Peoria,IL,61602,"(309) 674-6700","(309) 674-9071",philheinz@illinoispiping.com,"Sub Contractor; ","None of the Above; ",2024-04-16,16:00:13
"Golf Learning Center Addition & Renovation","Steve Mourisse","Yezek & Sons LLC","7700 North Crestline Drive ",Peoria,IL,61615,"(309) 691-2347",,smourisse@yezekandsons.com,"Supplier; ","None of the Above; ",2024-04-16,16:00:18
"Golf Learning Center Addition & Renovation","Andrew Kamm","Catalyst Construction","216 E. Grove St.Suite 2100 ",Bloomington,Illinois,61761,"(309) 808-2691",,akamm@catalystconstructs.com,"General Contractor; ","None of the Above; ",2024-04-16,17:29:19
"Golf Learning Center Addition & Renovation","Sean Handley",planhub,"1665 Palm Beach Lakes Blvd Ste.950 ","West Palm Beach",FL,33401,"(202) 843-5060",,projectcoordinator@planhub.com,"Other; ","None of the Above; ",2024-04-17,12:45:07
"Golf Learning Center Addition & Renovation","Bob Berns","Johnco Costruction, ,Inc.","107 W. 1st st. PO Box 469",Mackinaw,IL,61755,"(309) 359-3000","(309) 359-3900",bobberns@johncoconstrction.com,"General Contractor; ","None of the Above; ",2024-04-17,13:31:32
"Golf Learning Center Addition & Renovation",,,"906 SW Adams ",Peoria,IL,61602,"(309) 671-5414",,,"Other; ","None of the Above; ",2024-04-17,14:00:06
"Golf Learning Center Addition & Renovation",,,"906 SW Adams ",Peoria,IL,61602,"(309) 671-5417",,,"Sub Contractor; ","None of the Above; ",2024-04-17,14:24:11
"Golf Learning Center Addition & Renovation","Ashlee Dameron","The George Sollitt Construction Company","185 Hansen Court, Suite 100 ","Wood Dale",Illinois,60191,"(630) 860-7333",,adameron@sollitt.com,"General Contractor; ","None of the Above; ",2024-04-17,15:11:23
"Golf Learning Center Addition & Renovation","Destiny Vaquera","Hitchcock Design Group","22 E Chicago Ave Suite 200a",Naperville,Illinois,60540,"(183) 286-3921",,dvaquera@hitchcockdesigngroup.com,"Designer/Architect/Engineer; Other; ","None of the Above; ",2024-04-17,16:32:38
"Golf Learning Center Addition & Renovation","Ashe Himegarner","Cook Fasser","5835 n Galena rd ","peoria heights",il,61614,"(309) 349-0746",,ahimegarner@cookfasser.com,"Supplier; ","Woman-owned business; ",2024-04-17,16:45:48
"Golf Learning Center Addition & Renovation","lorebi Siga",ConstructConnect,"3825 Edwards Rd. Suite 800 ",Cincinnati,OH,45209,"(323) 602-5079",,lore.siga@constructconnect.com,"Other; ","None of the Above; ",2024-04-18,14:10:48
"Golf Learning Center Addition & Renovation","Bryan Daxon","Daxon Construction Company","1520 E. Le Claire Rd. ",Eldridge,Iowa,52748,"(563) 223-9570",,bdaxon@daxoninc.com,"General Contractor; ","None of the Above; ",2024-04-18,18:04:02
"Golf Learning Center Addition & Renovation","Amanda Hatcher","First Build Associates","410 Jubilee Lane, Suite A ","GERMANTOWN HILLS",Illinois,61548,"(309) 383-4510",,amanda@firstbuild.net,"General Contractor; ","None of the Above; ",2024-04-19,20:48:25
"Golf Learning Center Addition & Renovation",,," ",,,,,,,"Designer/Architect/Engineer; ","None of the Above; ",2024-04-19,21:00:10
"Golf Learning Center Addition & Renovation","Richard Joseph Rhodes","R.J. Rhodes Electric","4210 N. Northbrook CT ",Peoria,Illinois,61614,"(309) 989-7931",,Richard_rhodes2001@yahoo.com,"Sub Contractor; ","Minority-owned business; ",2024-04-21,16:32:41
"Golf Learning Center Addition & Renovation","Devin Birch","Austin Engineering Company, inc.","311 SW Water Street Suite 215",Peoria,IL,61602,"(309) 691-0224",,dbirch@austinengineeringcompany.com,"Other; ","None of the Above; ",2024-04-23,12:33:26
"Golf Learning Center Addition & Renovation","Destiny Vaquera","Hitchcock Design Group","1601 Rio 1601 Rio Grande St Suite 450",Austin,TX,78701,"(832) 863-9215",,dvaquera@hitchcockdesigngroup.com,"Designer/Architect/Engineer; ","None of the Above; ",2024-04-25,13:52:18
"Golf Learning Center Addition & Renovation","Ashe Himegarner","Cook Fasser"," ",,,,,,ahimegarner@cookfasser.com,"Supplier; ","Woman-owned business; ",2024-05-01,17:19:28
"Golf Learning Center Addition & Renovation","Matthew Hull","United Mechanical Group","1501 North Highland Avenue ",Champaign,Illinois,61821,"(217) 954-0211",,mhull@umg-il.com,"Sub Contractor; ","None of the Above; ",2024-05-02,14:33:22
