"File Downloaded","Full Name",Company,"Street Address",City,State,Zip,Phone,Fax,Email,About,"Date Downloaded","Time Downloaded"
"Asphalt Pavement Replacement at Safety Town","Michael Friberg","Peoria Park District","1314 North Park Road",Peoria,IL,61604,"(309) 686-3386",,mfriberg@peoriaparks.org,"Designer/Architect/Engineer; ",2020-05-05,12:43:00
"Asphalt Pavement Replacement at Safety Town",,,"23497 Ridge Rd ","East Peoria",il,61611,"(309) 698-8404","(309) 698-8431",,"General Contractor; ",2020-05-05,15:27:00
"Asphalt Pavement Replacement at Safety Town","Krystle Miller","Central Illinois Plan Room","1620 S 5th St ",Springfield,IL,62703,"(217) 679-1077",,plans@ciplanroom.com,"Plan Room; ",2020-05-05,16:38:55
"Asphalt Pavement Replacement at Safety Town","Bid Clerk","Prime Vendor","4622 Cedar Ave ",Wilmington,,28403,"(910) 805-9630",,primevendor123@gmail.com,"Sub Contractor; ",2020-05-06,08:12:01
"Asphalt Pavement Replacement at Safety Town","Dodge Dodge",Dodge,"300 American Metro Blvd #185 ","Hamilton Township",NJ,08619,"(866) 260-9240",,dodgedotadd@gmail.com,"Other; ",2020-05-06,09:55:34
"Asphalt Pavement Replacement at Safety Town","Amy Oberer",ConstructConnect,"3825 Edwards Rd #800 ",Cincinnati,OH,45209,"(513) 458-8604",,amy.oberer@constructconnect.com,"Plan Room; ",2020-05-06,13:15:52
"Asphalt Pavement Replacement at Safety Town","Kris Swanson","Otto Baum Co.","866 N. Main St. ",Morton,IL,61550,"(309) 266-7114","(309) 263-1050",estimating@ottobaum.com,"General Contractor; Sub Contractor; ",2020-05-06,14:47:16
"Asphalt Pavement Replacement at Safety Town",bfb,"The Blue Book Building and Construction Network","800 E Main St ","Jefferson Valley",NY,10535,"(800) 431-2584","(914) 243-4936",projectleads@mail.thebluebook.com,"Sub Contractor; ",2020-05-06,20:39:46
"Asphalt Pavement Replacement at Safety Town","Brandon Beck",UCM," ",,,,"(309) 846-8031",,brandon.beck@ucm.biz,"General Contractor; ",2020-05-06,21:12:10
"Asphalt Pavement Replacement at Safety Town","Amy Oberer",ConstructConnect,"3825 Edwards Rd #800 ",Cincinnati,OH,45209,"(513) 458-8604",,amy.oberer@constructconnect.com,"Plan Room; ",2020-05-13,14:17:32
"Asphalt Pavement Replacement at Safety Town","Craig Bergman",,"3451 Lumber Lane ",Springfield,IL,62707,"(217) 280-0331",,cbergman@midwestconstruct.com,"Supplier; ",2020-05-14,16:17:35
"Asphalt Pavement Replacement at Safety Town","City Coal & Asphalt","city coal","225 n second st ",pekin,,61554,"(309) 346-0564",,4citycoal@gmail.com,"General Contractor; ",2020-05-15,19:20:51
"Asphalt Pavement Replacement at Safety Town","City Coal & Asphalt","city coal","225 n second st ",pekin,,61554,"(309) 346-0564",,4citycoal@gmail.com,"General Contractor; ",2020-05-15,19:31:22
"Asphalt Pavement Replacement at Safety Town","Lyra de Asis","North Americarocurement Council, Inc."," ",,,,"(302) 450-1923","(302) 450-1925",lyra@napc.me,"Other; ",2020-05-16,05:36:11
"Asphalt Pavement Replacement at Safety Town","Brett villarreal",,"6408 w plank rd ",Peoria,Il,,"(309) 696-2054",,Bevillo@live.com,"Interested Citizen; ",2020-08-05,12:41:37
