"File Downloaded","Full Name",Company,"Street Address",City,State,Zip,Phone,Fax,Email,About,"Date Downloaded","Time Downloaded"
"Tennis Court Color Coating & Crack Repair- Sommer Park","Mary Harden","Peoria Park District","1314 N. Park Road ",Peoria,Illinois,61604,"(309) 686-3386",,mharden@peoriaparks.org,"Other; ",2019-08-06,12:40:51
"Tennis Court Color Coating & Crack Repair- Sommer Park","Angie Judge","All Weather Courts, INc","10188 Rte 36 E. PO Box 276",Dawson,IL,62520,"(217) 364-4433",,tennisawc@aol.com,"General Contractor; ",2019-08-06,13:04:18
"Tennis Court Color Coating & Crack Repair- Sommer Park","Bo Kim",Chicagoland,"P.O. Box 3533 ",Peoria,Illinois,61612,"(309) 401-6167","(309) 401-6168",bodedi3@aol.com,"Other; ",2019-08-06,15:41:52
"Tennis Court Color Coating & Crack Repair- Sommer Park","samantha Lewis","construct connect","3825 Edwards Road, Suite 800 ",Cincinnati,Oio,45209,"(800) 364-2059","(866) 570-8187",samantha.lewis@constructconnect.com,"Plan Room; ",2019-08-06,16:32:27
"Tennis Court Color Coating & Crack Repair- Sommer Park","Krystle Miller","Central Illinois Plan Room","1620 S 5th Street ",Springfield,IL,62703,,,plans@ciplanroom.com,"Plan Room; ",2019-08-06,18:07:46
"Tennis Court Color Coating & Crack Repair- Sommer Park","Greg Lucas","McConnell & Associates","9241 Manchester Road ","St. Louis",MO,63144,"(314) 962-1920",,g.lucas@mcconnellassociates.prg,"General Contractor; ",2019-08-07,11:42:06
"Tennis Court Color Coating & Crack Repair- Sommer Park","Angela Judge","All Weather Courts, INc","10188 Rte 36 E. PO Box 276",Dawson,IL,62520,"(217) 364-4433",,tennisawc@aol.com,"General Contractor; ",2019-08-14,15:34:43
"Tennis Court Color Coating & Crack Repair- Sommer Park","Simon Rhein",ConstructConnect,"3825 Edwards Road, Suite 800 ",Cincinnati,Ohio,45209,"(800) 364-2059",,Simon.Rhein@constructconnect.com,"Plan Room; ",2019-09-06,16:52:20
"Tennis Court Color Coating & Crack Repair- Sommer Park","Simon Rhein",ConstructConnect,"3825 Edwards Road, Suite 800 ",Cincinnati,Ohio,45209,"(800) 364-2059",,Simon.Rhein@constructconnect.com,"Plan Room; ",2019-09-17,14:26:24
