"File Downloaded","Full Name",Company,"Street Address",City,State,Zip,Phone,Fax,Email,"Date Downloaded","Time Downloaded"
"Lion Overlook - Peoria Zoo","Mary Harden","Peoria Park District","1314 N. Park Road ",Peoria,Illinois,61604,"(309) 686-3386",,mharden@peoriaparks.org,2018-10-16,17:16:11
"Lion Overlook - Peoria Zoo",,,"814 W. 120 TH ST. ",CHICAGO,IL.,60643,"(708) 562-2911","(708) 563-2915",,2018-10-16,17:45:20
"Lion Overlook - Peoria Zoo","Keeler Ekman","Cemrock Landscapes Inc","4790 S Julian Ave ",Tucson,AZ,85714,"(520) 571-1999",,kekman@cemrock.com,2018-10-16,17:52:01
"Lion Overlook - Peoria Zoo","TONY BENBENEK","K-THREE WELDING SERVICES INC.","814 W. 120 TH ST. ",CHICAGO,IL.,60643,"(708) 563-2911","(708) 569-2915",TKTHREE@COMCAST.NET,2018-10-16,17:58:02
"Lion Overlook - Peoria Zoo","Rachael Willis",constructconnect,"3825 Edwards Road Suite 800 ",Cincinnati,OH,45209,"(800) 364-2059",,Rachael.Willis@constructconnect.com,2018-10-16,18:00:07
"Lion Overlook - Peoria Zoo","Kris Swanson","Otto Baum Co., Inc.","866 N. Main St. ",Morton,IL,6150,"(309) 266-7114","(309) 263-1050",krisswanson@ottobaum.com,2018-10-16,18:33:05
"Lion Overlook - Peoria Zoo","Shane English","Ground Effects Landscape Supply","1801 S. Bridge St ",Yorkville,Illinois,60560,"(630) 553-6195",,shane.english@groundeffectsinc.com,2018-10-16,19:26:27
"Lion Overlook - Peoria Zoo","Maria Guzman","Hacienda Landscaping, Inc.","17840 Grove Rd.",Minooka,IL,60447,"(815) 782-6493",,nohemihacienda@yahoo.com,2018-10-16,19:37:51
"Lion Overlook - Peoria Zoo","Dan Moore","Kreiling Roofing Co.","2335 W Altorfer Rd ",Peoria,IL,61615,"(309) 673-3649",,dmoore@kreiling.com,2018-10-17,12:00:58
"Lion Overlook - Peoria Zoo","Erin Mool","Stark Excavating, Inc.","1805 W. Washington St. ",Bloomington,IL,61701,"(309) 828-5034","(309) 829-3897",estimating@starkcompanies.com,2018-10-17,12:55:45
"Lion Overlook - Peoria Zoo","Krystle Miller","Central Illinois Plan Room","1620 S 5th Street ",Springfield,IL,62703,"(217) 679-1077",,plans@ciplanroom.com,2018-10-17,13:23:53
"Lion Overlook - Peoria Zoo","Ryan Zobrist","Zobrist Construction","95 Commerce Drive ",Morton,ILLINOIS,61550,"(309) 263-1230","(309) 263-2838",ryanazobrist@gmail.com,2018-10-17,13:41:12
"Lion Overlook - Peoria Zoo","Stephen Bishop","Bishop Bros Inc","2800 Alta lane PO Box 3854",Peoria,Illinois,61612,"(309) 243-5599",,sbishopbbi@comcast.net,2018-10-17,14:31:42
"Lion Overlook - Peoria Zoo","Nate Zeltwanger","CAD Construction","508 E Pearl Street Unit A-1",Tremont,IL,61568,"(309) 925-2092","(309) 925-2091",CAD.Nate@frontier.com,2018-10-17,16:27:34
"Lion Overlook - Peoria Zoo","Justin Ellis","Givsco Construction Company","2321 Lakeshore Drive ",Pekin,IL,61554,"(309) 620-9127","(309) 620-9128",jellis@givsco.com,2018-10-17,17:08:39
"Lion Overlook - Peoria Zoo","Gracelyn Romano","Dodge Data and Analytics","300 Metro Blvd ",Hamilton,NJ,08619,"(413) 354-8393",,gracelyn.romano@construction.com,2018-10-17,17:42:50
"Lion Overlook - Peoria Zoo",,"The Wassi Group / Print Services"," ",,,61550,,,info@wassigroup.com,2018-10-17,17:47:27
"Lion Overlook - Peoria Zoo","Kelly Anderson","D. Joseph Construction","5001 N University St ",Peoria,IL,61614,"(309) 692-1135","(309) 692-1644",kellyanderson@djoseph.com,2018-10-17,18:19:51
"Lion Overlook - Peoria Zoo","Greg Campen","Peoria Metro Construction","1925 S Darst Street ",Peoria,IL,61607,"(309) 671-1466","(309) 671-1426",gcampen@peoriametro.com,2018-10-17,18:37:40
"Lion Overlook - Peoria Zoo","Daniel Muno","George H. Rump Const. Co.","PO Box 9815 ",Peoria,Illinois,61612,"(309) 637-6114",,,2018-10-17,19:01:09
"Lion Overlook - Peoria Zoo","Charlie A Macaranas",Dodge,"300 American Metro Blvd. ",Hamilton,NJ,08619,"(413) 930-4076",,charlie.macaranas@construction.com,2018-10-17,19:49:53
"Lion Overlook - Peoria Zoo","Nickee Scott","Laverdiere Construction, Inc","4005 W Jackson Street ",Macomb,IL,61455,"(309) 837-1258","(309) 833-4993",nscott@lavconinc.com,2018-10-18,13:22:02
"Lion Overlook - Peoria Zoo",,,"100 N MAIN ST. SUITE 203","EAST PEORIA",,61611,"(309) 692-1473","(309) 692-1564",,2018-10-18,15:21:01
"Lion Overlook - Peoria Zoo",,," ",,,,,,,2018-10-18,16:29:28
"Lion Overlook - Peoria Zoo","Tristan Ishtar","Tristan Ishtar","1239 Commons court ",Clermont,FL,34711,"(407) 342-1100",,tristan@amazuluinc.com,2018-10-18,16:49:57
"Lion Overlook - Peoria Zoo","Miranda O'Bryan","Western Specialty Contractors","309 NE Rock Island Ave ",Peoria,IL,61603,"(309) 512-3860",,mirandao@westerngroup.com,2018-10-18,18:38:26
"Lion Overlook - Peoria Zoo","Junard Ardiente","Dodge Data & Analytics","‪300 American Metro Blvd. Suite 185 ",Hamilton,NJ,08619,"(413) 749-2564",,junard.ardiente@construction.com,2018-10-18,20:12:54
"Lion Overlook - Peoria Zoo","Richard  McFall","ABC Supply","399 Truck Haven ","East Peoria",IL,61611,"(309) 202-7022",,Richard.mcfall@abcsupply.com,2018-10-19,11:37:40
"Lion Overlook - Peoria Zoo","Lori Lucas","Richards-Wilcox Specialty Hardware","600 S Lake Street ",Aurora,IL,60506,"(630) 264-4501","(630) 897-6994",llucas@richardswilcox.com,2018-10-19,12:53:16
"Lion Overlook - Peoria Zoo","Troy Kaufert","Cost of Wisconsin Inc","4201 Hwy P ",Jackson,WI,53037,"(262) 677-6061","(262) 677-6020",tkaufert@costofwisconsin.com,2018-10-19,13:19:28
"Lion Overlook - Peoria Zoo","Sarah Kaczmarowski","Southern Illinois Builders Association","1468 Green Mount Road ",O'Fallon,IL,62269,"(618) 624-9055",,projects@siba-agc.org,2018-10-19,13:48:37
"Lion Overlook - Peoria Zoo","Daniel Muno","George H. Rump Const. Co.","PO Box 9815 ",Peoria,Illinois,61612,"(309) 637-6114",,,2018-10-19,14:29:34
"Lion Overlook - Peoria Zoo","Steve Heinz","Premier Fabrication","303 County Highway 8 PO Box 36",Congerville,IL,61729,"(309) 448-2338","(309) 448-2605",steve.heinz@premierfabrication.com,2018-10-19,15:47:27
"Lion Overlook - Peoria Zoo","Bid Clerk","Prime Vendor","4622 Cedar Ave ",Wilmington,"North Carolina",28403,"(800) 746-9554",,roni@prime-vendor.com,2018-10-22,06:39:20
"Lion Overlook - Peoria Zoo","Mike Barnal","TWM, Inc.","1665 N.  Main Street ",Morton,IL,61550,"(309) 326-6030",,mbarnal@TWM-inc.com,2018-10-22,14:14:51
"Lion Overlook - Peoria Zoo","Kyle Zellers","Halverson Construction Co., Inc.","620 N. 19th Street ",Springfield,IL,62702,"(217) 753-0027","(217) 753-1904",hbid@halversonconstruction.com,2018-10-22,14:36:58
"Lion Overlook - Peoria Zoo","Kelsey Swarthout","Interactive Group","27 E Russell St ",Columbus,OH,43215,"(614) 485-9886",,kswarthout@interactive-group.net,2018-10-22,14:52:34
"Lion Overlook - Peoria Zoo","Katie Pogioli","Vogue Painting, Inc.","PO Box 256 ",Dunlap,IL,61525,"(309) 243-2333","(309) 243-2334",vogue@vogueptg.com,2018-10-22,14:57:23
"Lion Overlook - Peoria Zoo","Ciaron Graham","Hein Construction","9130 N Industrial Road ",Peoria,IL,61615,"(309) 691-4774","(309) 691-4673",Ciaron@heinconstruction.com,2018-10-22,21:04:39
"Lion Overlook - Peoria Zoo","Nick Kontos","A. Lucas & Sons","1328 SW Washington ",Peoria,IL,61602,"(309) 673-8547",,ngk@alucasiron.com,2018-10-25,19:36:42
"Lion Overlook - Peoria Zoo","Mary Harden","Peoria Park District","1314 N. Park Road ",Peoria,Illinois,61604,"(309) 686-3386",,mharden@peoriaparks.org,2018-10-26,13:00:42
"Lion Overlook - Peoria Zoo","Elle Day","I have a few","504 E MCCLURE AVE ",Peoria,IL,61603,"(708) 539-9602",,eaday131519@gmail.com,2018-10-27,05:02:42
"Lion Overlook - Peoria Zoo","Gus Fune","Green Hat Web Solutions","100 Denver ",Denver,Colorado,111211,"(216) 520-5092",,gus@greenhatwebs.com,,2019-01-10,19:20:45
