"File Downloaded","Full Name",Company,"Street Address",City,State,Zip,Phone,Fax,Email,"Date Downloaded","Time Downloaded"
"Roof Replacement - Forest Park Nature Center Bird Wing","Michael Friberg","Peoria Park District","1314 North Park Road",Peoria,IL,61604,"(309) 686-3386",,mfriberg@peoriaparks.org,2018-09-25,15:28:50
"Roof Replacement - Forest Park Nature Center Bird Wing","Nancy Crain-Brown","Greater Peoria Contractors & Suppliers Association Inc","1811 W Altorfer Dr ",Peoria,IL,61615,"(309) 692-5710","(309) 692-5790",info@gpcsa.org,2018-09-25,16:10:53
"Roof Replacement - Forest Park Nature Center Bird Wing","irfan Mohammed","Wyman Roofing & Sheet Metal, Inc.","1325 E Moneta Ave ",Peoria,IL,61616,"(309) 679-0094",,irfan@wymanroofing.com,2018-09-25,18:26:39
"Roof Replacement - Forest Park Nature Center Bird Wing","Bob Esperum","Henson Robinson Company","3550 Great Northern Ave ",Springfield,IL,62711,"(217) 544-8451","(217) 241-2577",bob@henson-robinson.com,2018-09-25,19:16:19
"Roof Replacement - Forest Park Nature Center Bird Wing","Bid Clerk","Prime Vendor","4622 Cedar Ave ",Wilmington,"North Carolina",28403,"(800) 746-9554",,roni@prime-vendor.com,2018-09-26,05:03:57
"Roof Replacement - Forest Park Nature Center Bird Wing","Krystle Miller","Central Illinois Plan Room","1620 S 5th Street ",Springfield,IL,62703,"(217) 679-1077",,plans@ciplanroom.com,2018-09-26,13:22:56
"Roof Replacement - Forest Park Nature Center Bird Wing","Rachael Willis",constructconnect,"3825 Edwards Road Suite 800 ",Cincinnati,OH,45209,"(800) 364-2059",,Rachael.Willis@constructconnect.com,2018-09-26,14:15:51
"Roof Replacement - Forest Park Nature Center Bird Wing","Miranda O'Bryan","Western Specialty Contractors","309 NE Rock Island Ave ",Peoria,IL,61603,"(309) 512-3860",,mirandao@westerngroup.com,2018-09-26,17:56:52
"Roof Replacement - Forest Park Nature Center Bird Wing","Leia Myers","Advanced Commercial Roofing","3611 N. Staley Rd. ",Champaign,IL,61822,"(217) 344-8300",,leia.myers@tsicfcacr.com,2018-09-27,13:37:29
"Roof Replacement - Forest Park Nature Center Bird Wing","Dan Moore","Kreiling Roofing Co.","2335 W Altorfer Rd ",Peoria,IL,61615,"(309) 673-3649",,dmoore@kreiling.com,2018-09-27,20:54:37
"Roof Replacement - Forest Park Nature Center Bird Wing","Sheila Norman","Henson Robinson.com","3550 Great Northern Ave ",Springfield,IL,62711,"(217) 544-8451","(217) 241-2577",hrc@henson-robinson.com,2018-09-28,14:08:20
"Roof Replacement - Forest Park Nature Center Bird Wing","irfan Mohammed","Wyman Roofing & Sheet Metal, Inc.","1325 E Moneta Ave ",Peoria,IL,61616,"(309) 679-0094",,irfan@wymanroofing.com,2018-09-28,16:14:34
"Roof Replacement - Forest Park Nature Center Bird Wing",Richard,"ABC Supply"," ",,,,,,Richard.mcfall@abcsupply.com,2018-09-29,00:52:52
"Roof Replacement - Forest Park Nature Center Bird Wing","Tommy Arbuckle","AFE Construction","P.O. Box 10331 ",Peoria,IL,61612,"(309) 208-3092","(866) 491-2209",Tommy.afeinc@hotmail.com,2018-09-29,13:40:39
"Roof Replacement - Forest Park Nature Center Bird Wing","Leia Myers","Advanced Commercial Roofing","3611 N. Staley Rd. ",Champaign,IL,61822,"(217) 344-8300",,leia.myers@tsicfcacr.com,2018-10-02,14:11:59
"Roof Replacement - Forest Park Nature Center Bird Wing","Kevin Filotto","Filotto Roofing","2111 Oakland Ave ","Crest Hill",IL,60403,"(815) 740-5461",,kevin@filottoroofing.com,2018-10-03,13:09:41
"Roof Replacement - Forest Park Nature Center Bird Wing",,," ",,,,,,,2018-10-03,13:31:21
