"File Downloaded","Full Name",Company,"Street Address",City,State,Zip,Phone,Fax,Email,"Date Downloaded","Time Downloaded"
"Rotary Trailhead at Donovan Park","Michael Friberg","Peoria Park District","1314 N. Park Road ",Peoria,IL,61604,"(309) 686-3386",,mfriberg@peoriaparks.org,2018-07-17,14:11:20
"Rotary Trailhead at Donovan Park","Erin Mool","Stark Excavating, Inc.","1805 W. Washington St. ",Bloomington,IL,61701,"(309) 828-5034","(309) 829-3897",estimating@starkcompanies.com,2018-07-17,14:59:14
"Rotary Trailhead at Donovan Park","Sally Lowe","Illinois Civil Contractors, Inc.","420 Pinecrest Drive ","East Peoria",IL,61611,"(309) 694-4224","(309) 694-5676",slowe@ilcivil.com,2018-07-17,16:20:09
"Rotary Trailhead at Donovan Park","Krystle Miller","Central Illinois Plan Room","1620 S 5th Street ",Springfield,IL,62703,"(217) 679-1077",,plans@ciplanroom.com,2018-07-17,17:45:19
"Rotary Trailhead at Donovan Park","Kris Swanson","Otto Baum Co., Inc.","866 N. Main St. ",Morton,IL,61550,"(309) 266-7114","(309) 263-1050",estimating@ottobaum.com,2018-07-17,19:20:40
"Rotary Trailhead at Donovan Park","Greg Campen","Peoria Metro Construction","1925 S Darst Street ",Peoria,IL,61607,"(309) 671-1466","(309) 671-1426",gcampen@peoriametro.com,2018-07-17,20:20:40
"Rotary Trailhead at Donovan Park","Nancy Crain-Brown","Greater Peoria Contractors & Suppliers Association Inc","1811 W Altorfer Drive ",Peoria,IL,61615,"(309) 692-5710","(309) 692-5790",info@gpcsa.org,2018-07-17,20:24:42
"Rotary Trailhead at Donovan Park","Bruce Cox","C & G Concrete Construction Co., Inc.","1906 Meadows Ave. ","East Peoria",IL,61611,"(309) 208-2646","(309) 699-6922",bruce@cngconcrete.com,2018-07-17,20:27:41
"Rotary Trailhead at Donovan Park","Ciaron Graham","Hein Construction","9130 N Industrial Road ",Peoria,IL,61615,"(309) 691-4774","(309) 691-4673",ciaron@heinconstruction.com,2018-07-17,20:55:11
"Rotary Trailhead at Donovan Park","Ryan Zobrist","Zobrist Construction","95 Commerce Drive ",Morton,IL,61550,"(309) 263-1230",,ryanazobrist@gmail.com,2018-07-17,21:19:17
"Rotary Trailhead at Donovan Park","Bid Clerk","Prime Vendor","4622 Cedar Ave ",Wilmington,NC,28403,"(800) 746-9554","(800) 746-8307",roni@prime-vendor.com,2018-07-18,04:21:49
"Rotary Trailhead at Donovan Park",Dodge,Dodge,"830 Third Avenue, 6th Floor",NewYork,NewYork,10022,"(877) 784-9556",,Dodgefedbr@construction.com,2018-07-18,08:38:19
"Rotary Trailhead at Donovan Park","Dan Moore","Kreiling Roofing Co.","2335 W Altorfer Rd ",Peoria,IL,61615,"(309) 673-3649",,dmoore@kreiling.com,2018-07-18,11:48:45
"Rotary Trailhead at Donovan Park","Nickee Scott","Laverdiere Construction, Inc","5044 W Jackson Street ",Macomb,IL,61455,"(309) 837-1258","(309) 833-4993",nscott@lavconinc.com,2018-07-18,18:46:39
"Rotary Trailhead at Donovan Park","David Martin","CivilScape News","2736 N. Hampden Ct ",Chicago,IL,60614,"(888) 420-8985",,support@civilscapenews.com,2018-07-18,19:21:03
"Rotary Trailhead at Donovan Park","Cassidy Bailey",ConstructConnect,"3825 Edwards Road, Suite 800, ",Cincinnati,Ohio,45209,"(800) 364-2059",,cassidy.bailey@constructconnect.com,2018-07-18,19:48:52
"Rotary Trailhead at Donovan Park",,," ",,,,,,,2018-07-20,14:26:50
"Rotary Trailhead at Donovan Park","Jaime L Montgomery","IronHustler Excavating, Inc.","1604 W DETWEILLER DR ILLINOIS",Peoria,IL,61615,"(309) 691-9894",,jaimemontgomery@hotmail.com,2018-07-23,15:32:43
"Rotary Trailhead at Donovan Park",,,"15588 tr 1400 e ",Bradford,IL,61421,"(309) 897-9911",,,2018-07-24,03:29:41
"Rotary Trailhead at Donovan Park","Sarah Kaczmarowski","Southern Illinois Builders Association","1468 Green Mount Rd ",O'Fallon,IL,62269,"(618) 624-9055",,projects@siba-agc.org,2018-07-24,12:29:58
"Rotary Trailhead at Donovan Park","Larry Yasdick","Zenon Company","400 W. Dundee Road Suite 110","Buffalo Grove",IL.,60089,"(847) 548-1143","(847) 548-7069",larry@zenoncompany.com,2018-07-24,14:50:31
"Rotary Trailhead at Donovan Park","Todd Thorstenson","Howard L. White & Assoc., Inc.","P.O. Box 5197 ","Buffalo Grove",IL,60089,"(847) 870-7745","(847) 870-7806",todd@howardlwhite.com,2018-07-25,14:44:49
"Rotary Trailhead at Donovan Park",rich,"krumholz landscaping","9125 frye rd ",peoria,il,61615,"(309) 208-6241",,richardkrumholz@sbcglobal.net,2018-07-28,18:57:39
"Rotary Trailhead at Donovan Park",,," ",,,,,,,2018-10-18,12:13:54
