"File Downloaded","Full Name",Company,"Street Address",City,State,Zip,Phone,Fax,Email,"Date Downloaded","Time Downloaded"
"Natatorium Curtain Wall Painting",Mary,PPD,"1314 N Park Rd ",Peoria,IL,61603,"(309) 686-3386","(309) 686-3383",mharden@peoriaparks.org,2018-07-17,17:46:27
"Natatorium Curtain Wall Painting","Krystle Miller","Central Illinois Plan Room","1620 S 5th Street ",Springfield,IL,62703,"(217) 679-1077",,plans@ciplanroom.com,2018-07-17,17:50:11
"Natatorium Curtain Wall Painting","Chad Turpen","Niles Industrial","2600 SW Washington St ",Peoria,IL,61602,"(309) 676-0043",,chadturpen@nilesindustrial.com,2018-07-18,12:21:38
"Natatorium Curtain Wall Painting",Nick,"Te Corp"," ",,,,,,nickv@tecorp.us,2018-07-18,15:50:24
"Natatorium Curtain Wall Painting","Brittany Murdock",ConstructConnect,"3825 Edwards Road 800",Cincinnati,OH,45209,"(800) 364-2059","(866) 570-8187",Brittany.Murdock@constructconnect.com,2018-07-18,17:37:42
"Natatorium Curtain Wall Painting","Deloris Howard",,"2731 W 174 Street ","Hazel Crest",IL,60429,"(312) 285-9101",,deloris_howard@yahoo.com,2018-07-18,18:25:22
"Natatorium Curtain Wall Painting","Omari Stamps","MARSOLINOS CONSTRUCTION CO. INC","2138 S Indiana ",Chicago,IL,60616,"(630) 480-1806",,ostamps8888@yahoo.com,2018-07-18,19:09:05
"Natatorium Curtain Wall Painting","Nicole Owens","The PIPCO Companies Ltd","1409 W. Altorfer Dr. ",Peoria,Illinois,61615,"(309) 692-4060",,nicoleo@pipco-co.com,2018-07-19,13:39:18
"Natatorium Curtain Wall Painting",,," ",,,,,,,2018-07-20,14:29:57
"Natatorium Curtain Wall Painting","George Poulos","G.P. Maintenance Services Inc.","10512 South Michael Drive ","Palos Hills",IL,60465,"(708) 430-0469","(708) 430-5546",gpmaintsvcs@att.net,2018-07-21,23:57:02
"Natatorium Curtain Wall Painting","Nate Zeltwanger","CAD Construction","508 E Pearl Street Unit A-1",Tremont,IL,61568,"(309) 925-2092","(309) 925-2091",CAD.Nate@frontier.com,2018-07-23,14:40:32
"Natatorium Curtain Wall Painting",Alicia,ApaceDesign,"2112 E. War Memorial Drive ",Peoria,IL,61614,"(309) 685-4722",,alicia@apacedesign.com,2018-07-23,20:29:01
"Natatorium Curtain Wall Painting","Sarah Kaczmarowski","Southern Illinois Builders Association","1468 Green Mount Rd ",O'Fallon,IL,62269,"(618) 624-9055",,projects@siba-agc.org,2018-07-24,12:29:04
"Natatorium Curtain Wall Painting","Todd A. Budzik PE","BDB Engineering Co., LLC","PO Box 72360 ",Phoenix,Arizona,85050,"(602) 218-8504",,tbudzik@bdbengineering.com,"Designer/Architect/Engineer; ",2020-03-20,23:25:45
