"File Downloaded","Full Name",Company,"Street Address",City,State,Zip,Phone,Fax,Email,"Date Downloaded","Time Downloaded"
"Natatorium Painting - RiverPlex Recreation and Wellness Center","Mary Harden","Peoria Park District","1314 N. Park Road ",Peoria,Illinois,61604,"(309) 686-3386","(309) 686-3383",mharden@peoriaparks.org,2018-06-05,17:22:38
"Natatorium Painting - RiverPlex Recreation and Wellness Center","Shelly Kettle",," ",,,,,,,2018-06-05,17:29:43
"Natatorium Painting - RiverPlex Recreation and Wellness Center","Mary Harden","Peoria Park District","1314 N. Park Road ",Peoria,Illinois,61604,"(309) 686-3386",,mharden@peoriaparks.org,2018-06-05,17:33:05
"Natatorium Painting - RiverPlex Recreation and Wellness Center","Nate Zeltwanger","CAD Construction","508 E Pearl Street Unit A-1",Tremont,IL,61568,"(309) 925-2092","(309) 925-2091",CAD.Nate@frontier.com,2018-06-05,17:47:03
"Natatorium Painting - RiverPlex Recreation and Wellness Center","Ben Kauffman","apaceDesign architects and engineers","2112 E. War Memorial Dr ",Peoria,IL,61614,"(309) 685-4722",,ben@apacedesign.com,2018-06-05,18:45:24
"Natatorium Painting - RiverPlex Recreation and Wellness Center","Jerame Cokel",Cullinan/UCM," ",Tremont,IL,61568,"(309) 299-2099",,jerame.cokel@ucm.biz,2018-06-05,20:47:43
"Natatorium Painting - RiverPlex Recreation and Wellness Center","Brian Booth","Givsco Construction","Givsco Construction ","2321 Lakeshore Drive",Illinois,61554,"(309) 620-9127",,bbooth@givsco.com,2018-06-05,21:34:02
"Natatorium Painting - RiverPlex Recreation and Wellness Center","Joel Hartman","Associated Constructors Co., Inc.","103 Caroline St. ",Bloomington,IL,61701,"(309) 827-8522","(309) 454-6766",joel@associatedconstructors.com,2018-06-06,13:23:10
"Natatorium Painting - RiverPlex Recreation and Wellness Center",,," ",,,,,,,2018-06-06,13:24:32
"Natatorium Painting - RiverPlex Recreation and Wellness Center","Krystle Miller","Central Illinois Plan Room","1620 S 5th Street ",Springfield,IL,62703,"(217) 679-1077",,plans@ciplanroom.com,2018-06-06,14:05:33
"Natatorium Painting - RiverPlex Recreation and Wellness Center","Chris J. Wascher","Taylor Coating Sales, Inc.","8520 Brookfield Avenue ",Brookfield,IL,60513,"(708) 601-8520","(708) 387-7941",cwascher@tnemec.com,2018-06-07,15:19:39
"Natatorium Painting - RiverPlex Recreation and Wellness Center","Daniel Muno","General Contractor","PO Box 9815 ",Peoria,IL,61612,"(309) 637-6114","(309) 637-6120",dan@rumpconstruction.com,2018-06-11,15:40:20
"Natatorium Painting - RiverPlex Recreation and Wellness Center","Chad Turpen","Niles Industrial Coatings","2600 SW Washington St ",Peoria,IL,61602,"(309) 676-0043","(309) 676-0049",chadturpen@nilesindustrial.com,2018-06-12,16:36:29
"Natatorium Painting - RiverPlex Recreation and Wellness Center","Sridhar Kota","Hein Construction Co., Inc.","9130 N Industrial Road ",Peoria,IL,61615,"(309) 691-4774","(309) 691-4673",kota@heinconstruction.com,2018-06-13,18:41:51
"Natatorium Painting - RiverPlex Recreation and Wellness Center","Greg Campen","Peoria Metro Construction","1925 S Darst Street ",Peoria,IL,61607,"(309) 671-1466","(309) 671-1426",gcampen@peoriametro.com,2018-06-19,18:29:16
"Natatorium Painting - RiverPlex Recreation and Wellness Center","Grant Zobrist","Zobrist Construction","95 Commerce Dr ",MORTON,Illinois,61550,"(309) 263-1230",,gzobrist@mtco.com,2018-06-19,19:08:23
"Natatorium Painting - RiverPlex Recreation and Wellness Center","Stephen Bishop","Bishop Bros Inc","2800 Alta lane PO Box 3854",Peoria,Illinois,61612,"(309) 243-5599",,sbishopbbi@comcast.net,2018-06-19,19:48:40
"Natatorium Painting - RiverPlex Recreation and Wellness Center","Nick  Visvardis","Tecorp, Inc","2221 muriel ct ",Joliet,Illinois,60433,"(815) 726-9192","(815) 726-9245",Nvisvardis@tecorp.us,2018-06-25,21:00:52
"Natatorium Painting - RiverPlex Recreation and Wellness Center",jeremy,"ahern fire protection","316 sw washington ",peoria,il,61602,"(309) 422-6862",,jlester@ahernfire.com,2018-06-27,15:07:03
"Natatorium Painting - RiverPlex Recreation and Wellness Center","Todd A. Budzik PE","BDB Engineering Co., LLC","PO Box 72360 ",Phoenix,Arizona,85050,"(602) 218-8504",,tbudzik@bdbengineering.com,"Designer/Architect/Engineer; ",2020-03-20,23:27:21
