"File Downloaded","Full Name",Company,"Street Address",City,State,Zip,Phone,Fax,Email,"Date Downloaded","Time Downloaded"
"Exterior Staining - Golf Learning Center","Nancy Crain-Brown","Greater Peoria Contractors & Suppliers Association Inc.","1811 W Altorfer Dr ",Peoria,Illinois,61615,"(309) 692-5710","(309) 692-5790",info@gpcsa.org,2017-09-19,17:23:32
"Exterior Staining - Golf Learning Center","Mary Harden","Peoria Park District","1314 N. Park Road ",Peoria,Illinois,61604,"(309) 686-3386",,mharden@peoriaparks.org,2017-09-19,18:26:08
"Exterior Staining - Golf Learning Center","Bid Clerk","Prime Vendor","4622 Cedar Ave ",Wilmington,NC,28403,"(800) 746-9554",,ranju@prime-vendor.com,2017-09-20,10:21:13
"Exterior Staining - Golf Learning Center","Krystle Miller","Central Illinois Plan Room","1620 S 5th Street ",Springfield,IL,62703,"(217) 679-1077",,plans@ciplanroom.com,2017-09-20,14:22:14
"Exterior Staining - Golf Learning Center","Latiecha Crowden","Dodge Data & Analytics","4300 Beltway Place Suite 180",Arlington,Texas,76018,"(817) 527-8244","(800) 768-5594",latiecha.crowden@construction.com,2017-09-20,18:47:17
"Exterior Staining - Golf Learning Center","Cassidy Bailey",ConstructConnect,"3825 Edwards Road, Suite 800 Suite 800",Cincinnati,Ohio,45209,"(800) 364-2059","(866) 570-8187",cassidy.bailey@constructconnect.com,2017-09-22,13:34:26
"Exterior Staining - Golf Learning Center","Justin Ellis","Givsco Construction Company","2321 Lakeshore Drive ",Pekin,IL,61554,"(309) 620-9127","(309) 620-9128",jellis@givsco.com,2017-09-25,21:33:51
"Exterior Staining - Golf Learning Center","Tom Nott","Niles Industrial Coatings, LLC","2600 SW Washington St ",Peoria,IL,61602,"(309) 676-0043","(309) 676-0049",tomnot@nilesindustrial.com,2017-09-26,13:03:04
"Exterior Staining - Golf Learning Center","Chris Lewis","Mid-Illinois Companies","905 N.E. Adams St. ",Peoria,IL,61603,"(309) 674-0717","(309) 674-5802",clewis@mic123.com,2017-09-26,14:47:26
"Exterior Staining - Golf Learning Center","Kurt Hand","Vogue Painting, Inc.","11419 N State St-B PO Box 444",Mossville,IL,61552,"(309) 579-3393","(309) 579-3292",vogue@vogueptg.com,2017-09-26,16:55:10
"Exterior Staining - Golf Learning Center","Chad Turpen","Niles Industrial","2600 SW Washington St ",Peoria,ILq,61602,"(309) 676-0043","(309) 676-0049",chadturpen@nilesindustrial.com,2017-10-02,11:43:04
"Exterior Staining - Golf Learning Center","Todd schafer","Colosseum painting","5 greenbrier dr ",Mackinaw,Il,61755,,,Colosseumpainting@yahoo.com,2017-10-03,16:30:45
"Exterior Staining - Golf Learning Center","Todd schafer","Colosseum painting","5 greenbrier dr ",Mackinaw,Il,61755,,,Colosseumpainting@yahoo.com,2017-10-03,16:54:50
"Exterior Staining - Golf Learning Center","Todd schafer","Colosseum painting","5 greenbrier dr ",Mackinaw,Il,61755,,,Colosseumpainting@yahoo.com,2017-10-03,16:55:43
"Exterior Staining - Golf Learning Center","Todd schafer","Colosseum painting","5 greenbrier dr ",Mackinaw,Il,61755,,,Colosseumpainting@yahoo.com,2017-10-03,16:58:11
"Exterior Staining - Golf Learning Center","Todd schafer","Colosseum painting","5 greenbrier dr ",Mackinaw,Il,61755,,,Colosseumpainting@yahoo.com,2017-10-03,17:18:30
"Exterior Staining - Golf Learning Center","kurt hand","vogue painting","PO Box 444 ",Mossville,IL,61552,"(309) 579-3393",,vogue@vogueptg.com,2017-10-04,14:29:31
"Exterior Staining - Golf Learning Center",mike,ppd,"1314 n park road ",peoria,il,61604,"(309) 686-3386","(309) 686-3383",mfriberg@peoriaparks.org,2017-11-02,19:27:37
