"File Downloaded","Full Name",Company,"Street Address",City,State,Zip,Phone,Fax,Email,"Date Downloaded","Time Downloaded"
"District Wide Sealcoating",Linda,"Peoria Park District","1314 N. Park Rd. ",City,IL,61604,"(309) 686-3386",,lmatthews@peoriaparks.org,2016-05-17,13:38:06
"District Wide Sealcoating","Tim Gillette","P.A. Atherton Construction, Inc.","96 Eichhorn Road ","Spring Bay",IL,61611,"(309) 822-8575","(309) 822-8782",tgillette@mediacombb.net,2016-05-17,16:19:31
"District Wide Sealcoating","Heather Martin","Prime Vendor Inc","4622 Cedar Ave ",Wilmington,NC,28403,"(800) 746-9554",,work41@prime-vendor.com,2016-05-17,18:20:46
"District Wide Sealcoating","Heather Martin","Prime Vendor Inc","4622 Cedar Ave ",Wilmington,NC,28403,"(800) 746-9554",,work41@prime-vendor.com,2016-05-17,18:22:00
"District Wide Sealcoating","Troy Saunders","R.A. Cullinan & Son, a division of UCM, Inc.","121 West Park Street PO Box 166",Tremont,IL,61568,"(309) 925-2721","(309) 925-7131",troy.saunders@ucm.biz,2016-05-18,12:31:22
"District Wide Sealcoating","Krystle Tidyman","Central Illinois Plan Room","1620 S. 5th Street ",Springfield,Illinois,62703,"(217) 679-1077","(217) 544-6570",plans@ciplanroom.com,2016-05-18,14:54:18
"District Wide Sealcoating","Brandon Fogler","Tazewell County Asphalt","23497 Ridge Rd ","East Peoria",IL,61611,"(309) 698-8404","(309) 698-8431",tcaco@sbcglobal.net,2016-05-18,20:34:55
"District Wide Sealcoating",Brittany,"Construct Connect","3825 Edwards Rd Suite 800 ",Cincinnati,Ohio,45209,"(800) 364-2059",,brittany.murdock@constructconnect.com,2016-05-19,12:48:16
"District Wide Sealcoating",Brittany,"Construct Connect","3825 Edwards Rd Suite 800 ",Cincinnati,Ohio,45209,"(800) 364-2059",,brittany.murdock@constructconnect.com,2016-05-19,12:48:40
"District Wide Sealcoating","Brett Brown","AAA Striping and Sweeping, LLC","81 Eichorn Road East Peoria",,IL,61611,"(309) 208-9469","(309) 889-5040",bbrown331@yahoo.com,2016-05-19,20:55:27
"District Wide Sealcoating","Dean Marsteller",Denler,"19148 S 104th Ave ",Mokena,il,60448,"(708) 479-5005",,Denler@email.com,2016-05-21,19:22:04
"District Wide Sealcoating","cindy adams","master builders of iowa","221 Park Street ","Des Moines",Iowa,50309,"(515) 288-7339","(515) 288-8718",mbiplanroom-dsm@mbionline.com,2016-05-23,20:20:10
"District Wide Sealcoating",Test,Test," ",,,,,,Test@Test.com,2016-05-27,18:41:22
"District Wide Sealcoating",afad,adsfad," ",,,,"(309) 686-3357",,nstaley@peoriaparks.org,2016-08-11,19:28:18
