"File Downloaded","Full Name",Company,"Street Address",City,State,Zip,Phone,Fax,Email,"Date Downloaded","Time Downloaded"
"Drainage and Forward Tee Renovations - Newman Golf Course","mike friberg","Peoria Park District","1314 N. Park Road ",Peoria,IL,61604,"(309) 686-3386",,mfriberg@peoriaparks.org,2016-03-22,13:22:22
"Drainage and Forward Tee Renovations - Newman Golf Course","mike friberg","Peoria Park District","1314 N. Park Road ",Peoria,IL,61604,"(309) 686-3386",,mfriberg@peoriaparks.org,2016-03-22,13:22:56
"Drainage and Forward Tee Renovations - Newman Golf Course",Janet,"Peoria Reprographics Co.","711 NE Jefferson Street ",Peoria,Illinois,61603,"(309) 431-3427","(309) 839-2148",janet@peoriarepro.com,2016-03-22,13:50:58
"Drainage and Forward Tee Renovations - Newman Golf Course","Steve Wolbeck","Duininck Golf","408 6th Street ",Prinsburg,Minnesota,56281,"(320) 978-6011","(320) 978-4978",stevew@duininck.com,2016-03-22,15:17:04
"Drainage and Forward Tee Renovations - Newman Golf Course","Steve Wolbeck","Duininck Golf","408 6th Street ",Prinsburg,Minnesota,56281,"(320) 978-6011","(320) 978-4978",stevew@duininck.com,2016-03-22,15:45:18
"Drainage and Forward Tee Renovations - Newman Golf Course","Todd Quitno","Lohmann Golf Designs, Inc","18250 Beck Road ",Marengo,Illinois,60152,"(815) 923-3400",,tquitno@lohmann.com,2016-03-22,16:28:50
"Drainage and Forward Tee Renovations - Newman Golf Course","Todd Quitno","Lohmann Golf Designs, Inc","18250 Beck Road ",Marengo,Illinois,60152,"(815) 923-3400",,tquitno@lohmann.com,2016-03-22,16:33:28
"Drainage and Forward Tee Renovations - Newman Golf Course","Sally Lowe","Illinois Civil Contractors, Inc.","420 Pinecrest Drive ","East Peoria",IL,61611,"(309) 694-4224","(309) 694-5676",slowe@ilcivil.com,2016-03-22,18:25:33
"Drainage and Forward Tee Renovations - Newman Golf Course",Sherry,"Bid Ocean, Inc.","PO Box 40445 ","Grand Junction",CO,"Grand Junction","(970) 242-7277","(970) 256-9704",sherry@bidocean.com,2016-03-23,05:31:04
"Drainage and Forward Tee Renovations - Newman Golf Course","Tim Gillette","P.A. Atherton Construction, Inc.","96 Eichhorn Road ","Spring Bay",IL,61611,"(309) 822-8575","(309) 822-8782",tgillette@mediacombb.net,2016-03-23,12:17:36
"Drainage and Forward Tee Renovations - Newman Golf Course","Tim Gillette","P.A. Atherton Construction, Inc.","96 Eichhorn Road ","Spring Bay",IL,61611,"(309) 822-8575","(309) 822-8782",tgillette@mediacombb.net,2016-03-23,12:21:32
"Drainage and Forward Tee Renovations - Newman Golf Course","Bill Aupperle","Aupperle Construction","190 E Washington ",Morton,IL,61550,"(309) 266-7460","(309) 263-2223",bill@aupperle.org,2016-03-23,12:34:09
"Drainage and Forward Tee Renovations - Newman Golf Course","Brittany Murdock",Isqft,"4500 Lake forest drive suite 502 ",Cincinnati,Ohio,45242,,,bmurdock@isqft.com,2016-03-23,15:39:14
"Drainage and Forward Tee Renovations - Newman Golf Course","Doug Myslinski","XGD Systems","415 Flagler Ave Unit #302",Stuart,Florida,34994,"(888) 943-3419",,dougm@xgd.systems,2016-03-23,15:50:34
"Drainage and Forward Tee Renovations - Newman Golf Course","Kris Swanson","Otto Baum","866 N. Main St. ",Morton,IL,61550,"(309) 266-7114","(309) 263-1050",estimating@ottobaum.com,2016-03-23,23:54:44
"Drainage and Forward Tee Renovations - Newman Golf Course","Lyra de Asis","North America Procurement Council, Inc."," PO Box 40445","Grand Junction",CO,81504,"(302) 450-1923","(302) 450-1925",lyra@napc.me,2016-03-24,04:14:25
"Drainage and Forward Tee Renovations - Newman Golf Course","Tony Scachette","Commercial Irrigation","109 Commercial dr. E. Peoria","East Peoria",IL,61611,"(309) 208-2148","(309) 698-1702",tony@comirr.com,2016-03-24,14:56:21
"Drainage and Forward Tee Renovations - Newman Golf Course","Heather Martin","Prime Vendor Inc","4622 Cedar Avenue Suite 123",Wilmington,NC,28403,"(800) 746-9554","(800) 746-8307",work41@prime-vendor.com,2016-03-24,16:27:25
"Drainage and Forward Tee Renovations - Newman Golf Course","Rick Jacobson","Jacobson Golf Course Design, Inc.","838 Furlong Dr. ",Libertyville,Illinois,60048,"(847) 918-1361","(847) 918-1374",rick@jacobsongolfcoursedesign.com,2016-03-24,16:40:46
"Drainage and Forward Tee Renovations - Newman Golf Course","JEff Hollembeak","Hollembeak Construction","Box 103 8S239 Rhodes St","Big Rock",IL,60511,"(630) 675-5000","(630) 556-3892",jeff@hollembeak.com,2016-03-25,11:06:09
"Drainage and Forward Tee Renovations - Newman Golf Course","Rick Walker","Walker Excavating Co., Inc.","3222 W. Farmington Rd. ",Peoria,IL,61604,"(309) 674-6617","(309) 446-3149",office@walkerexc.com,2016-03-25,14:03:08
"Drainage and Forward Tee Renovations - Newman Golf Course","Becky Fredrickson","Peoria Park District","1314 N. Park Road ",Peoria,IL,61604,"(309) 686-3386","(309) 686-3383",rfredrickson@peoriaparks.org,2016-03-25,14:38:01
"Drainage and Forward Tee Renovations - Newman Golf Course",Jessica,"Golf Preservations","504 Gloucester Ave. ",Middleboro,KY,40965,"(606) 248-7435",,golfpreservations@yahoo.com,2016-03-25,20:38:36
"Drainage and Forward Tee Renovations - Newman Golf Course","Makenzi Peyton","Stark Excavating, Inc.","1805 W. Washington Street ",Bloomington,Illinois,61701,"(309) 828-5034","(309) 829-3897",mpeyton@starkcompanies.com,2016-03-28,14:25:28
"Drainage and Forward Tee Renovations - Newman Golf Course","Meridith Deverman","Peoria Park District","7815 N. Radnor Road `",Peoria,IL,61615,"(309) 689-3329","(309) 689-3349",mdeverman@peoriaparks.org,2016-03-28,15:20:41
"Drainage and Forward Tee Renovations - Newman Golf Course","Jim Lohmann","Golf Creations","18250 Beck Rd. ",Marengo,Illinois,60152,"(815) 923-1868","(815) 923-3662",jlohmann@lohmann.com,2016-03-28,15:26:20
"Drainage and Forward Tee Renovations - Newman Golf Course","JIm Lohmann","Golf Creations","18250 Beck Road ",Marengo,Illinois,60152,"(815) 923-1868","(815) 923-3662",jlohmann@lohmann.com,2016-03-28,16:00:20
"Drainage and Forward Tee Renovations - Newman Golf Course","Kurt Kieser","Tri-County Irrigation and Plumbing Inc.","PO Box 290 ",Goodfield,Il.,61742,"(309) 965-2057","(309) 965-2376",kurt@tricountyirrigation.com,2016-03-29,13:34:08
"Drainage and Forward Tee Renovations - Newman Golf Course","Andrew Lehman","Tri County Irrigation & Plumbing, Inc.","PO Box 290 ",Goodfield,IL,61742,"(309) 965-2057","(309) 965-2376",andrew@tri-countyirrigation.com,2016-03-29,13:57:09
"Drainage and Forward Tee Renovations - Newman Golf Course","Tony Scachette","Commercial Irrigation","109 Commercial dr. E. Peoria","East Peoria",IL,61611,"(309) 208-2148","(309) 698-1702",tony@comirr.com,2016-03-29,15:14:35
"Drainage and Forward Tee Renovations - Newman Golf Course","Tony Scachette","Commercial Irrigation","109 Commercial dr. E. Peoria","East Peoria",IL,61611,"(309) 208-2148","(309) 698-1702",tony@comirr.com,2016-03-29,15:15:15
"Drainage and Forward Tee Renovations - Newman Golf Course","Will Leidy",ADS,"401 Olive Street ",Findlay,OH,45840,"(419) 424-8210",,william.leidy@ads-pipe.com,2016-03-29,20:27:43
"Drainage and Forward Tee Renovations - Newman Golf Course","Rochelle Smyk","Golf Creations","18250 Beck Road ",Marengo,Il,60152,"(815) 923-1868","(815) 923-3662",rsmyk@lohmann.com,2016-03-30,14:39:00
"Drainage and Forward Tee Renovations - Newman Golf Course","Krystle Tidyman","Central Illinois Plan Room","1620 S. 5th Street ",Springfield,Illinois,62703,"(217) 679-1077","(217) 544-6570",plans@ciplanroom.com,2016-03-30,14:48:21
"Drainage and Forward Tee Renovations - Newman Golf Course","Rich Krumholz","Krumholz Bros Landscaping","9125 N. Frye Rd ",Peoria,IL,61615,"(309) 208-6241",,richardkrumholz@sbcglobal.net,2016-03-31,13:20:11
"Drainage and Forward Tee Renovations - Newman Golf Course","mike nelson","J. L. Nelson Construction","1500 w barker ave ",Peoria,Il,61606,"(309) 264-7565","(309) 674-7565",mike.nelson3@comcast.net,2016-04-01,14:17:37
"Drainage and Forward Tee Renovations - Newman Golf Course","Mike Nelson","J. L. Nelson Const.","1500 W. Barker Ave. ",Peoria,Il,61606,"(309) 264-7565","(309) 674-7565",mike.nelson3@comcast.net,2016-04-01,15:33:31
"Drainage and Forward Tee Renovations - Newman Golf Course","Tony Scachette","Commercial Irrigation","109 Commercial dr. ",,IL,e.peoria,"(309) 698-3011","(309) 698-1702",tony@comirr.com,2016-04-04,13:42:35
"Drainage and Forward Tee Renovations - Newman Golf Course","Tony Scachette","Commercial Irrigation","109 Commercial dr. ",,IL,e.peoria,"(309) 698-3011","(309) 698-1702",tony@comirr.com,2016-04-04,13:45:36
"Drainage and Forward Tee Renovations - Newman Golf Course",,," ",,,,,,,2016-04-04,18:08:13
"Drainage and Forward Tee Renovations - Newman Golf Course",,," ",,,,,,,2016-04-04,18:09:34
"Drainage and Forward Tee Renovations - Newman Golf Course",,," ",,,,,,,2016-04-04,18:09:46
"Drainage and Forward Tee Renovations - Newman Golf Course","Craig Bergman","Midwest Construction Products","3451 lumber lane ",Springfield,IL,62707,"(217) 280-0331",,cbergman@midwestconstruct.com,2016-04-04,23:20:27
"Drainage and Forward Tee Renovations - Newman Golf Course","Alec Stephens",UCM,"PO Box 166 ",Tremont,IL,61568,"(309) 925-2721","(309) 925-7131",alec.stephens@ucm.biz,2016-04-05,13:40:45
"Drainage and Forward Tee Renovations - Newman Golf Course",jacob,"N.E. Finch","1925 Darst St ",Peoria,IL,61607,"(309) 671-1444","(309) 671-1449",jdye@nefinch.com,2016-04-05,14:39:04
"Drainage and Forward Tee Renovations - Newman Golf Course",,," ",,,,,,,2016-04-05,18:40:51
"Drainage and Forward Tee Renovations - Newman Golf Course",,," ",,,,,,,2016-04-11,13:18:16
"Drainage and Forward Tee Renovations - Newman Golf Course",,," ",,,,,,,2016-04-11,13:18:30
"Drainage and Forward Tee Renovations - Newman Golf Course","sharon riesenbeck","Waupaca Sand","1508 lake holiday drive ",il,60548,sandwich,"(630) 212-5746",,sharon@waupacasand.com,2016-04-12,15:45:34
"Drainage and Forward Tee Renovations - Newman Golf Course","Dashiell Harrison","Green Hat Webs"," ",Denver,Colorado,80207,,,dash@greenhatwebs.com,2016-05-20,13:21:51
