"File Downloaded","Full Name","Company","Street Address","City","State","Zip","Phone","Fax","Email","Date Downloaded","Time Downloaded"
"RFQ Madison Golf Course Concrete Ledge","Mary Harden","PPD","1314 N Park Road","Peoria","IL","61604","309 686 3386","309 686 3383","mharden@peoriaparks.org","2015-03-11","09:54:41"
"RFQ Madison Golf Course Concrete Ledge","Ciaron Graham","Hein Construction","9130 N Industrial Road","Peoria","IL","61615","309-691-4774","309-691-4673","ciaron@heinconstruction.com","2015-03-11","11:33:58"
"RFQ Madison Golf Course Concrete Ledge","Madhumita Dey","reed Construction Data","30 Technology Pkwy S #100","Norcross","GA","30092","800.424.3996","800.467.2860","Madhumita.dey@cmdgroup.com","2015-03-12","06:58:58"
"RFQ Madison Golf Course Concrete Ledge","Madhumita Dey ","CMD","30 Technology Parkway, Ste 100","Norcross","GA","30096","877-665-8770","800-303-8629","Docprocessing@reedbusiness.com","2015-03-12","09:13:33"
"RFQ Madison Golf Course Concrete Ledge","Joe Schremser","CMD","30 Technology Pkwy","Norcross","GA","30092","7702093436","","joe.schremser@cmdgroup.com","2015-03-12","11:31:16"
"RFQ Madison Golf Course Concrete Ledge","Eric Johnson","BidOcean","PO Box 40445","Grand Junction","CO","81504","866-347-9657","970-256-9704","eric@bidocean.com","2015-03-17","00:25:19"
"RFQ Madison Golf Course Concrete Ledge","Tim Baylon","Tim Baylon","Langhorne-Newton rd","Peoria","NJ","08234","2677593729","2677593730","bjones@cdcnews.com","2015-03-17","10:04:35"
"RFQ Madison Golf Course Concrete Ledge",,," ",,,,,,,2016-05-26,15:34:53
