"File Downloaded","Full Name",Company,"Street Address",City,State,Zip,Phone,Fax,Email,"Date Downloaded","Time Downloaded"
"Tawny Oaks Barn Roof","Michael Friberg","Peoria Park District","1314 North Park Road",Peoria,IL,61604,"(309) 686-3386",,mfriberg@peoriaparks.org,2018-10-16,15:19:05
"Tawny Oaks Barn Roof","Nancy Crain-Brown","Greater Peoria Contractors & Suppliers Association Inc","1811 W Altorfer Dr ",Peoria,IL,61615,"(309) 692-5710","(309) 692-5790",info@gpcsa.org,2018-10-16,18:01:22
"Tawny Oaks Barn Roof","Rachael Willis",constructconnect,"3825 Edwards Road Suite 800 ",Cincinnati,OH,45209,"(800) 364-2059",,Rachael.Willis@constructconnect.com,2018-10-16,18:03:37
"Tawny Oaks Barn Roof","Kris Swanson","Otto Baum Co., Inc.","866 N. Main ",Morton,IL,61550,"(309) 266-7114","(309) 263-1050",estimating@ottobaum.com,2018-10-16,18:44:08
"Tawny Oaks Barn Roof","irfan Mohammed","Wyman Roofing & Sheet Metal, Inc.","1325 E Moneta Ave ",Peoria,IL,61616,"(309) 679-0094",,irfan@wymanroofing.com,2018-10-16,19:35:42
"Tawny Oaks Barn Roof","Dan Moore","Kreiling Roofing Co.","2335 W Altorfer Rd ",Peoria,IL,61615,"(309) 673-3649",,dmoore@kreiling.com,2018-10-17,11:53:09
"Tawny Oaks Barn Roof","Krystle Miller","Central Illinois Plan Room","1620 S 5th Street ",Springfield,IL,62703,"(217) 679-1077",,plans@ciplanroom.com,2018-10-17,13:22:26
"Tawny Oaks Barn Roof","Ryan Zobrist","Zobrist Construction","95 Commerce Dr. ",Morton,IL,61550,"(309) 263-1230","(309) 263-2838",ryanazobrist@gmail.com,2018-10-17,13:48:40
"Tawny Oaks Barn Roof","Stephen Bishop","Bishop Bros Inc","2800 Alta lane PO Box 3854",Peoria,Illinois,61612,"(309) 243-5599",,sbishopbbi@comcast.net,2018-10-17,14:35:56
"Tawny Oaks Barn Roof",Nate,"CAD Construction Inc.","508 E Pearl St Unit A-1",Tremont,IL,61568,"(309) 925-2092","(309) 925-2091",CAD.Nate@frontier.com,2018-10-17,16:18:06
"Tawny Oaks Barn Roof",,," ",,,,,,,2018-10-18,12:54:51
"Tawny Oaks Barn Roof","Kevin Filotto","Filotto Roofing","2111 Oakland Ave ","Crest Hill",IL,60403,"(815) 740-5461",,kevin@filottoroofing.com,2018-10-18,19:02:44
"Tawny Oaks Barn Roof","Darrell Caho","Richards Building Supply","8710 N. Pioneer Road ",Peoria,Il,61615,"(309) 693-8900",,dcaho@richards-supply.com,2018-10-18,21:50:13
"Tawny Oaks Barn Roof","Richard  McFall","ABC Supply","399 Truck Haven ","East Peoria",IL,61611,"(309) 202-7022",,Richard.mcfall@abcsupply.com,2018-10-19,11:35:50
"Tawny Oaks Barn Roof","Mark Roady","Roady Exteriors, LLC","PO Box 46 ",Marine,IL,62061,"(314) 489-4686",,mark@roadyexteriors.com,2018-10-19,12:15:11
"Tawny Oaks Barn Roof","Sarah Kaczmarowski","Southern Illinois Builders Association","1468 Green Mount Road ",O'Fallon,IL,62269,"(618) 624-9055",,projects@siba-agc.org,2018-10-19,13:46:03
"Tawny Oaks Barn Roof","Bid Clerk","Prime Vendor","4622 Cedar Ave ",Wilmington,"North Carolina",28403,"(800) 746-9554",,roni@prime-vendor.com,2018-10-22,06:33:23
"Tawny Oaks Barn Roof","michael j. friberg",none,"3311 N. Biltmore Ave. ",Peoria,Illinois,61604,"(309) 648-5057",,michael_friberg@comcast.net,2018-12-01,20:02:11
"Tawny Oaks Barn Roof",,," ",,,,,,,2018-12-14,16:11:49
