"File Downloaded","Full Name",Company,"Street Address",City,State,Zip,Phone,Fax,Email,"Date Downloaded","Time Downloaded"
"Front Desk and Hallway Finishes - Lakeview Recreation Center","Michael Friberg","Peoria Park District","1314 N. Park Road ",Peoria,IL,61604,"(309) 686-3386",,mfriberg@peoriaparks.org,2018-06-05,12:53:05
"Front Desk and Hallway Finishes - Lakeview Recreation Center",Kota,"Hein Construction Co., Inc.","9130 N Industrial Road ",Peoria,IL,61615,"(309) 691-4774","(309) 691-4673",kota@heinconstruction.com,2018-06-05,14:42:47
"Front Desk and Hallway Finishes - Lakeview Recreation Center","Alex Danner","Advanced Commercial Roofing","po box 7738 ",CHAMPAIGN,Illinois,61826,"(217) 328-7321",,alex.danner@tsicfcacr.com,2018-06-05,15:07:22
"Front Desk and Hallway Finishes - Lakeview Recreation Center","Richard Nash","Vonderheide Floor Coverings Co","105 North 14th St ",Pekin,IL,61554,"(309) 346-3688","(309) 346-6724",dicknashvfc@gmail.com,2018-06-05,15:18:18
"Front Desk and Hallway Finishes - Lakeview Recreation Center","Daniel Muno","General Contractor","PO Box 9815 ",Peoria,IL,61612,"(309) 637-6114","(309) 637-6120",dan@rumpconstruction.com,2018-06-05,15:27:22
"Front Desk and Hallway Finishes - Lakeview Recreation Center","Alex Danner","TSI Commercial Floor Covering","3611 N. Staley Road ",CHAMPAIGN,Illinois,61822,"(217) 328-7321",,alex.danner@tsicfcacr.com,2018-06-05,15:28:16
"Front Desk and Hallway Finishes - Lakeview Recreation Center","Richard Nash","Vonderheide Floor Coverings Co","105 North 14th St ",Pekin,IL,61554,"(309) 346-3688","(309) 346-6724",dicknashvfc@gmail.com,2018-06-05,15:37:14
"Front Desk and Hallway Finishes - Lakeview Recreation Center","Nate Zeltwanger","CAD Construction","508 E Pearl Street Unit A-1",Tremont,IL,61568,"(309) 925-2092","(309) 925-2091",CAD.Nate@frontier.com,2018-06-05,16:13:17
"Front Desk and Hallway Finishes - Lakeview Recreation Center","Alex Danner",TSI,"3611 N. Staley Road ",CHAMPAIGN,Illinois,61822,"(217) 328-7321",,alex.danner@tsicfcacr.com,2018-06-05,16:17:47
"Front Desk and Hallway Finishes - Lakeview Recreation Center","Justin Davis","Columbia Rug Carpet One","2522 W War Memorial Dr ",Peoria,IL,61615,"(309) 692-5040",,justincrc1@gmail.com,2018-06-05,16:35:00
"Front Desk and Hallway Finishes - Lakeview Recreation Center","Grant Zobrist","Zobrist Construction","95 Commerce Dr ",MORTON,Illinois,61550,"(309) 263-1230","(309) 263-2838",gzobrist@mtco.com,2018-06-05,16:37:46
"Front Desk and Hallway Finishes - Lakeview Recreation Center","Patrick Coyle","Menold Construction","880 W Jefferson Ave ",Morton,IL,61550,"(309) 208-4192","(309) 263-2438",pcoyle@menoldinc.com,2018-06-05,17:55:55
"Front Desk and Hallway Finishes - Lakeview Recreation Center","Chris Stirewalt","Neverman Floor Artisans","2801 gemini ct ",Champaign,Illinois,61822,"(217) 398-1834",,Chris@nevfloorart.com,2018-06-05,18:45:19
"Front Desk and Hallway Finishes - Lakeview Recreation Center","Chris Stirewalt","Neverman Floor Artisans","2801 gemini ct ",Champaign,Illinois,61822,"(217) 398-1834",,Chris@nevfloorart.com,2018-06-05,19:29:48
"Front Desk and Hallway Finishes - Lakeview Recreation Center","Jerame Cokel",Cullinan/UCM," ",Tremont,IL,61568,"(309) 299-2099",,jerame.cokel@ucm.biz,2018-06-05,20:40:48
"Front Desk and Hallway Finishes - Lakeview Recreation Center","Krystle Miller","Central Illinois Plan Room","1620 S 5th Street ",Springfield,IL,62703,"(217) 679-1077",,plans@ciplanroom.com,2018-06-06,14:04:10
"Front Desk and Hallway Finishes - Lakeview Recreation Center","Vernon Priest","Messing Roofing Company","3416 NE Adams Street ",Peoria,IL,61603,"(309) 645-3736",,vernon@messingconstruction.com,2018-06-06,14:25:40
"Front Desk and Hallway Finishes - Lakeview Recreation Center",Chris,GPCSA," ",,,,,,cbrown@gpcsa.org,2018-06-06,14:44:06
"Front Desk and Hallway Finishes - Lakeview Recreation Center",,," ",,,,,,,2018-06-06,16:03:32
"Front Desk and Hallway Finishes - Lakeview Recreation Center","Cassidy Bailey",ConstructConnect,"3825 Edwards Road, Suite 800, ",Cincinnati,Ohio,45209,"(800) 364-2059",,cassidy.bailey@constructconnect.com,2018-06-06,16:29:59
"Front Desk and Hallway Finishes - Lakeview Recreation Center","Ryan Schifeling","Central Illinois Commercial Flooring","1011 W Olympia Dr ",Peoria,IL,61615,"(309) 693-8800","(309) 693-8804",estimating.cifc@gmail.com,2018-06-06,18:04:46
"Front Desk and Hallway Finishes - Lakeview Recreation Center","Greg Campen","Peoria Metro Construction","1925 S Darst Street ","Peoria, IL",Illinois,61607,"(309) 671-1466","(309) 671-1426",gcampen@peoriametro.com,2018-06-06,21:03:35
"Front Desk and Hallway Finishes - Lakeview Recreation Center","Tommy Arbuckle","AFE Construction","P.O. Box 10331 ",Peoria,IL,61612,"(309) 208-3092","(866) 491-2209",Tommy.afeinc@hotmail.com,2018-06-07,14:27:09
"Front Desk and Hallway Finishes - Lakeview Recreation Center","Stephen Bishop","Bishop Bros Inc","2800 Alta lane PO Box 3854",Peoria,Illinois,61612,"(309) 243-5599","(309) 243-5632",sbishopbbi@comcast.net,2018-06-07,18:45:32
"Front Desk and Hallway Finishes - Lakeview Recreation Center","Mary O'Connor","Contractor's Register, Inc.","800 East Main Street ","Jefferson Valley",,10535,"(800) 431-2584",,moconnor@mail.thebluebook.com,2018-06-11,13:45:08
"Front Desk and Hallway Finishes - Lakeview Recreation Center","Sridhar Kota","Hein Construction Co., Inc.","9130 N Industrial Road ",Peoria,IL,61615,"(309) 691-4774","(309) 691-4673",kota@heinconstruction.com,2018-06-13,18:34:16
"Front Desk and Hallway Finishes - Lakeview Recreation Center","Daniel Muno","General Contractor","PO Box 9815 ",Peoria,IL,61612,"(309) 637-6114",,dan@rumpconstruction.com,2018-06-19,17:24:07
"Front Desk and Hallway Finishes - Lakeview Recreation Center","Daniel Muno",,"420 W Westfield Ct ",Dunlap,Illinois,61525,"(309) 637-6114",,,2018-06-19,17:53:11
"Front Desk and Hallway Finishes - Lakeview Recreation Center",,," ",,,,,,,2018-08-02,16:16:38
