"File Downloaded","Full Name",Company,"Street Address",City,State,Zip,Phone,Fax,Email,"Date Downloaded","Time Downloaded"
"Roof Replacement - Donovan Park Clubhouse - Upper Roof","fjjhgjh fgjhfg",jhnfghghg,"fhfggnfg ngfgngng",fgngng,Illinois,12345,"(963) 434-5455","(999) 464-4634",gghjgjy@gmail.com,2018-04-03,16:07:57
"Roof Replacement - Donovan Park Clubhouse - Upper Roof",Mohammed,"Wyman Roofing & Sheet Metal, Inc.","1325 E Moneta Ave ",Peoria,IL,61616,"(309) 679-0094",,irfan@wymanroofing.com,2018-04-03,18:58:39
"Roof Replacement - Donovan Park Clubhouse - Upper Roof",irfan,"Wyman Roofing & Sheet Metal, Inc.","1325 E Moneta Ave ",Peoria,IL,61616,"(309) 679-0094",,irfan@wymanroofing.com,2018-04-03,19:00:19
"Roof Replacement - Donovan Park Clubhouse - Upper Roof","David Durflinger","Kreiling Roofing Co","2335 W Altorfer Drive ",Peoria,IL,61615,"(309) 673-3649",,ddurflinger@kreiling.com,2018-04-03,19:07:04
"Roof Replacement - Donovan Park Clubhouse - Upper Roof","Krystle Miller","Central Illinois Plan Room","1620 S 5th Street ",Springfield,IL,62703,"(217) 679-1077","(217) 544-6570",plans@ciplanroom.com,2018-04-04,14:27:30
"Roof Replacement - Donovan Park Clubhouse - Upper Roof",gopninath,"dodge reports","aaaa aaabo",india,tamilnadu,624586,,,gopinath@construction.com,2018-04-04,15:10:16
"Roof Replacement - Donovan Park Clubhouse - Upper Roof","Mary Harden","Peoria Park District","1314 N. Park Road ",Peoria,Illinois,61604,"(309) 686-3863",,mharden@peoriaparks.org,2018-04-04,19:38:15
"Roof Replacement - Donovan Park Clubhouse - Upper Roof","Mary O'Connor","Contractor's Register, Inc.","800 East Main Street ","Jefferson Valley",NY,10535,"(800) 431-2584",,moconnor@mail.thebluebook.com,2018-04-06,13:53:22
"Roof Replacement - Donovan Park Clubhouse - Upper Roof","Morgan Stinson",constructconnect,"4500 Lake Forest Drive, Suite 502 ",Cincinnati,OH,45242,"(800) 364-2059",,content@constructconnect.com,2018-04-09,11:46:29
"Roof Replacement - Donovan Park Clubhouse - Upper Roof","Justin Ellis","Givsco Construction Company","2321 Lakeshore Drive ",Pekin,IL,61554,"(309) 620-9127","(309) 620-9128",jellis@givsco.com,2018-04-09,15:56:26
"Roof Replacement - Donovan Park Clubhouse - Upper Roof","Cassidy Bailey",ConstructConnect,"3825 Edwards Road, Suite 800, ",Cincinnati,Ohio,45209,"(800) 364-2059",,cassidy.bailey@constructconnect.com,2018-04-09,18:48:53
"Roof Replacement - Donovan Park Clubhouse - Upper Roof","Tommy Arbuckle","AFE Construction","P.O. Box 10331 ",Peoria,Illinois,61612,"(309) 208-3092","(866) 491-2209",tommy.afeinc@hotmail.com,2018-04-09,18:51:46
"Roof Replacement - Donovan Park Clubhouse - Upper Roof","Jared Osterman",," ",,,61614,,,jaredo@westerngroup.com,2018-04-10,13:03:48
"Roof Replacement - Donovan Park Clubhouse - Upper Roof","Jared Osterman",," ",,,61614,,,jaredo@westerngroup.com,2018-04-11,13:15:56
"Roof Replacement - Donovan Park Clubhouse - Upper Roof",Sheila,"Henson Robinson Company","3550 Great Northern Ave ",Springfield,IL,62711,"(217) 544-8451","(217) 241-2577",hrc@henson-robinson.com,2018-04-11,17:17:30
"Roof Replacement - Donovan Park Clubhouse - Upper Roof",Sheila,"Henson Robinson company","3550 Great Northern Ave ",Springfield,IL&gt;,62711,"(217) 544-8451","(217) 241-2577",hrc@henson-robinson.com,2018-04-11,19:31:27
"Roof Replacement - Donovan Park Clubhouse - Upper Roof",,," ",,,,,,,2018-04-16,16:16:02
"Roof Replacement - Donovan Park Clubhouse - Upper Roof","Jon E Johnson",,"35 Van Dyke Drive ",Canton,IL,61520,"(309) 338-4670",,leatherneck0351@me.com,2018-09-11,15:44:17
