"File Downloaded","Full Name",Company,"Street Address",City,State,Zip,Phone,Fax,Email,"Date Downloaded","Time Downloaded"
"Trewyn Park Pavilion Roof Replacement","Linda Matthews","Peoria Park District","1314 N. Park Road ",Peoria,IL,61604,"(309) 686-3386",,lmatthews@peoriaparks.org,2016-05-17,13:44:52
"Trewyn Park Pavilion Roof Replacement","Heather Martin","Prime Vendor Inc","4622 Cedar Ave ",Wilmington,NC,28403,"(800) 746-9554",,work41@prime-vendor.com,2016-05-17,18:17:18
"Trewyn Park Pavilion Roof Replacement","Heather Martin","Prime Vendor Inc","4622 Cedar Ave ",Wilmington,NC,28403,"(800) 746-9554",,work41@prime-vendor.com,2016-05-17,18:18:41
"Trewyn Park Pavilion Roof Replacement","Krystle Tidyman","Central Illinois Plan Room","1620 S. 5th Street ",Springfield,Illinois,62703,"(217) 679-1077","(217) 544-6570",plans@ciplanroom.com,2016-05-18,14:53:05
"Trewyn Park Pavilion Roof Replacement",Brittany,"Construct Connect","3825 Edwards Rd Suite 800 ",Cincinnati,Ohio,45209,"(800) 364-2059",,brittany.murdock@constructconnect.com,2016-05-19,14:31:06
"Trewyn Park Pavilion Roof Replacement","Sheila Norman","Henson Robinson Company","3550 Great Northern Ave ",Springfield,Illinois,62711,"(217) 544-8451","(217) 241-2577",hrc@henson-robinson.com,2016-05-19,16:32:35
"Trewyn Park Pavilion Roof Replacement","Nancy Crain-Brown","Greater Peoria Contractors & Suppliers Association","1811 W Altorfer Dr ",Peoria,IL,61615,"(309) 692-5710","(309) 692-5790",info@gpcsa.org,2016-05-20,16:45:05
"Trewyn Park Pavilion Roof Replacement","Justin Ellis","Givsco Construction Company","2321 Lakeshore Drive ",Pekin,IL,61554,"(309) 620-9127","(309) 620-9128",jellis@givsco.com,2016-05-20,21:29:22
"Trewyn Park Pavilion Roof Replacement","Gary Atkins","Wyman Roofing & Sheet Metal, Inc.","1325 E. Moneta ","Peoria Heights",IL,"Peoria 61616Heights","(309) 679-0094","(309) 679-0479",gary@wymanroofing.com,2016-05-23,14:07:53
"Trewyn Park Pavilion Roof Replacement","Bill Aupperle","Aupperle Construction","190 E Washington Morton",Morton,Illinois,61550,,,bill@aupperle.org,2016-05-23,18:20:17
"Trewyn Park Pavilion Roof Replacement","Linda Duncan","River City Construction","101 Hoffer Lane ",,,"East Peoria","(309) 694-3120","(309) 694-1332",lduncan@rccllc.com,2016-05-23,18:21:26
"Trewyn Park Pavilion Roof Replacement","Kris Swanson","Otto Baum","866 N. Main St. ",Morton,IL,61550,"(309) 266-7114","(309) 263-1050",estimating@ottobaum.com,2016-05-23,18:22:51
"Trewyn Park Pavilion Roof Replacement","cindy adams","master builders of iowa","221 Park Street ","Des Moines",Iowa,50309,"(515) 288-7339","(515) 288-8718",mbiplanroom-dsm@mbionline.com,2016-05-23,20:18:11
"Trewyn Park Pavilion Roof Replacement","Dave Durflinger","Kreiling Roofing Co","2335 W Altorfer Dr ",Peoria,IL,61615,"(309) 673-3649",,ddurflinger@kreiling.com,2016-05-24,13:48:21
"Trewyn Park Pavilion Roof Replacement",Greg,"Peoria Metro Construction","1925 S Darst Street ",Peoria,IL,61547,"(309) 671-1466","(309) 671-1426",gcampen@peoriametro.com,2016-05-24,16:35:03
"Trewyn Park Pavilion Roof Replacement","Darrell Caho","Western Specialty Contractors","309 NE Rock Island Ave 309 NE Rock Island Ave",Peoria,IL,61603,"(309) 676-2374","(309) 676-3831",darrellc@westerngroup.com,2016-05-24,17:05:32
"Trewyn Park Pavilion Roof Replacement","jack morgan","Hein Construction","9130 n industrial rd ",,Il.,"peoria 61615","(309) 691-4774",,jack@heinconstruction.com,2016-05-24,17:47:36
"Trewyn Park Pavilion Roof Replacement",,," ",,,,,,,2016-05-31,11:18:26
"Trewyn Park Pavilion Roof Replacement",,," ",,,,,,,2016-05-31,11:18:50
"Trewyn Park Pavilion Roof Replacement","dash harrison",," ",,,,,,dash@greenhatwebs.com,2016-06-07,13:41:15
"Trewyn Park Pavilion Roof Replacement",,," ",,,,,,,2017-05-02,19:07:04
